{"text_format":"3","workbook":"xlsx","n_sheets":15,"sheets":["Vendor IDS","Summary","email-approvals","Deadlines","Transportation","Mileage log","Donor","Meals-Donor","Office Expense","Out-of-town Travel","Professional Growth","Ministry Ops","Meals-Students","Capital","2nd page"],"not_rendered":{"external_links":1,"defined_names":68},"read":"whole","date_system":"1900"}

{"sheet":"Vendor IDS","index":0,"n_rows":711,"n_cols":22,"rows_kept":711,"hidden":true}
["Account Code","Vendor Name","Status","Account Title","initials","Dept/Proj Code","Fund Code","Name","=LEN(D2)",{"$f":"LEN(#REF!)","v":{"$error":"#REF!"}},null,null,"Account Number","Vendor ID","Vendor Name","Check Address Code",{"$nulls":3},"Account Number","Vendor ID","Vendor Name"]
[0,{"$nulls":4},0,"F","=SEARCH(\")\",D2,1)","=SEARCH(\"(\",D2,1)",{"$f":"SEARCH(\"(\",#REF!,1)","v":{"$error":"#REF!"}},null," "," "," "]
[1100,{"$f":"E3","v":"EO"},{"$f":"IFERROR(MID(D3,SEARCH(\"{\",D3,1)+1,SEARCH(\"}\",D3,1)-SEARCH(\"{\",D3,1)-1),\"\")","v":""},"Executive Office (1100) 0%",{"$f":"LEFT(D3,1)&MID(D3,SEARCH(\" \",D3,1)+1,1)","v":"EO"},{"$f":"A3","v":1100},100,{"$f":"LEFT(D3,SEARCH(\"(\",D3,1)-1)","v":"Executive Office "},"NMF",{"$f":"SEARCH(\")\",#REF!,1)","v":{"$error":"#REF!"}},null,{"$f":"RIGHT(O3,LEN(O3)-SEARCH(\" \",O3,1))","v":"ADRIAN"},5364,{"$f":"_xlfn.IFNA(VLOOKUP(M3,T:U,2,),\"\")","v":"ADRIAN"},"ANNE ADRIAN","Main",{"$nulls":3},5364,"ADRIAN","ANNE ADRIAN"]
[1101,"PC","","President's Contingency (1101) 0%","PC",1101,100,"President's Contingency ","NMF",{"$f":"MID(#REF!,4,1)","v":{"$error":"#REF!"}},null,"AINSWORTH",5145,"AINSWORTH Jacob","Jacob ainsworth","Main",{"$nulls":3},5145,"AINSWORTH Jacob","JACOB AINSWORTH"]
[1605,"BI","","Building Initiative (1605) 25%","BI",1605,200,"Building Initiative ","NMF",null,null,"AKHTAR",5317,"AKHTAR R","RASHEED AKHTAR","Main",{"$nulls":3},5317,"AKHTAR R","RASHEED AKHTAR"]
[2101,"MD","Decker","Ministry Department (2101) 0% {Decker}","MD",2101,100,"Ministry Department ","NMF",null,null,"ALLEN",5764,"ALLEN NORM","NORMAN ALLEN","Main",{"$nulls":3},5764,"ALLEN NORM","NORMAN ALLEN"]
[2102,"NT","Decker","National Training Department (2102) 0% {Decker}","NT",2102,100,"National Training Department ","NMF",null,null,"ALTHOUSE",5391,"ALTHOUSE VALER","VALERIE ALTHOUSE","Main",{"$nulls":3},5391,"ALTHOUSE VALER","VALERIE ALTHOUSE"]
[2104,"PS","","People Services (2104) 0%","PS",2104,100,"People Services ","NMF",null,null,"ALUMBAUGH",5141,"ALUMBAUGH J R","JON ALUMBAUGH","Main",{"$nulls":3},5000,"ALTIZER KAY","KATHRYN ALTIZER"]
[2301,"WR","Zeigler","Western Region  (2301) 0% {Zeigler}","WR",2301,100,"Western Region  ","NMF",null,null,"ALUMBAUGH",5141,"ALUMBAUGH J R","JONATHAN ALUMBAUGH","Main",{"$nulls":3},5141,"ALUMBAUGH J R","JON OR RUTH ALUMBAUGH"]
[2302,"S/","Germann","SE / Great Lakes Region (2302) 0% {Germann}","S/",2302,100,"SE / Great Lakes Region ","NMF",null,null,"ANDREWS",5065,"ANDREWS CAROLYN","CAROLYN ANDREWS","Main",{"$nulls":3},5141,"ALUMBAUGH JONA","JONATHAN ALUMBAUGH"]
[2303,"R&","Jackson","RM & Plains Region (2303) 0% {Jackson}","R&",2303,100,"RM & Plains Region ","NMF",null,null,"ANTHONY",5394,"ANTHONY J","JEFFREY ANTHONY","Main",{"$nulls":3},"","ANALLA BRIAN","BRIAN ANALLA"]
[2304,"Do","","Director of Field Develompment (2304)","Do",2304,100,"NMF Major Donor Days ","NMF",null,null,"APGAR",5210,"APGAR DON","DON APGAR","Main",{"$nulls":3},5065,"ANDREWS CAROLYN","CAROLYN ANDREWS"]
[2306,"NR","Larson","Northeastern Region (2306) 10% {Larson}","NR",2306,100,"Northeastern Region ","NMF",null,null,"APGAR",5210,"APGAR DON","SUE APGAR","Main",{"$nulls":3},5394,"ANTHONY J","JEFFREY ANTHONY"]
[2500,"GM","Prensner","Global Ministries (2500) {Prensner}","GM",2500,100,"Global Ministries ","NMF",null,null,"ARANT",5156,"ARANT J","JULIE ARANT","Main",{"$nulls":3},5210,"APGAR DON","DON APGAR"]
[2510,"IS","","ISnt'l Singapore (2510) 0%","IS",2510,100,"ISnt'l Singapore ","NMF",null,null,"AUVIL",5623,"AUVIL RON","RON AUVIL","Main",{"$nulls":3},5210,"APGAR SUE","SUE APGAR"]
[2520,"IL","","ISI Ltd Hong Kong (2520) 0%","IL",2520,100,"ISI Ltd Hong Kong ","NMF",null,null,"BABCOCK",5489,"BABCOCK RANDALL","RANDALL BABCOCK","Main",{"$nulls":3},5156,"ARANT J","JULIE ARANT"]
[2530,"II","","IS International Misc Countries (2530) 0%","II",2530,100,"IS International Misc Countries ","NMF",null,null,"BAKER",5660,"BAKER HERB","HERB BAKER","Main",{"$nulls":3},"","ARCHAMBAULT AL","ALLISSA ARCHAMBAULT"]
[2600,"Ws","","Web site/Publications (2600) 0%","Ws",2600,100,"Web site/Publications ","NMF",null,null,"Bastian",5925,"BASTIAN D&P","Doug Bastian","Main",{"$nulls":3},5623,"AUVIL RON","RON AUVIL"]
[3100,"O(","","Operations (3100) 0%","O(",3100,100,"Operations ","NMF",null,null,"BECKER",5777,"BECKER JUDY","JUDY BECKER","Main",{"$nulls":3},5489,"BABCOCK RANDALL","RANDALL BABCOCK"]
["10%)","WR","","Western Region (10%) ","WR","10%)",500,"Western Region ","SPEC",null,null,"Bell",5666,"BELL ANDREW","Andrew Bell","Main",{"$nulls":3},5660,"BAKER HERB","HERB BAKER"]
["10%)","RM","","Rocky Mtn Plains (10%)","RM","10%)",500,"Rocky Mtn Plains ","SPEC",null,null," BERGER",5581,"BERGER JOHN","JOHN  BERGER","Main",{"$nulls":3},5925,"BASTIAN D&P","Doug & Patty Bastian"]
[3115,"NR","Larson","Northeastern Region (3115) 10% {Larson}","NR",3115,500,"Northeastern Region ","SPEC",null,null,"BERGMAN",5550,"BERGMAN, J & M","JEFF BERGMAN","Main",{"$nulls":3},5777,"BECKER JUDY","JUDY BECKER"]
["10%)","SG","","Southern Great Lakes Region (10%)","SG","10%)",500,"Southern Great Lakes Region ","SPEC",null,null,"BEVAN",5597,"BEVAN J R","ROB BEVAN","Main",{"$nulls":3},5666,"BELL ANDREW","Andrew Bell"]
[3150,"E&","","Expansion & Recruitment (3150) 0%","E&",3150,100,"Expansion & Recruitment ","NMF",null,null,"BILLINGS",5584,"BILLINGS JUDY","JUDY BILLINGS","Main",{"$nulls":3},5581,"BERGER JOHN","JOHN & LINDA BERGER"]
[3200,"F(","","Finance (3200) 0%","F(",3200,100,"Finance ","NMF",null,null,"BLACK",5619,"BLACK HELEN","HELEN BLACK","Main",{"$nulls":3},5550,"BERGMAN, J & M","BERGMAN, Jeff & Michiko"]
[3290,"II","","Interest/Div Income (3290) 0%","II",3290,100,"Interest/Div Income ","NMF",null,null,"BOGEN",5625,"BOGEN MARK","MARK BOGEN","Main",{"$nulls":3},5597,"BEVAN J R","Joyce and Rod Bevan"]
[3300,"MA","","Ministry Advancement  (3300) 0%","MA",3300,100,"Ministry Advancement  ","NMF",null,null,"ALYNN BOITZ",5158,"BOITZ (CURTIS)","JOY ALYNN BOITZ","Main",{"$nulls":3},5584,"BILLINGS JUDY","JUDY BILLINGS"]
[3301,"SD","","San Diego Launch Initiatives (3301) 0%","SD",3301,100,"San Diego Launch Initiatives ","NMF",null,null,"BOYD",5434,"BOYD ROY","ROY BOYD","Main",{"$nulls":3},5619,"BLACK HELEN","HELEN BLACK"]
[3302,"HL","","Houston Launch Initiatives (3302) 0%","HL",3302,100,"Houston Launch Initiatives ","NMF",null,null,"BOYLE",5342,"BOYLE CHAR & T","CHARLES BOYLE","Main",{"$nulls":3},5625,"BOGEN MARK","Mark Bogen"]
[3303,"NM","","NMF Major Donor Days (3303) 0%","NM",3303,100,"NMF Major Donor Days ","NMF",null,null,"BRAINTWAIN",5178,"BRAINTWAIN S","STEPHEN BRAINTWAIN","Main",{"$nulls":3},5158,"BOITZ (CURTIS)","JOY ALYNN BOITZ"]
[5001,"IN","Larson","Ithica NY (5001) 15% {Larson}","IN",5001,500,"Ithica NY ","CITY",null,null,"BRANNEN",5706,"BRANNEN","DAN BRANNEN","Main",{"$nulls":3},2101,"BOLTON TERESA","TERESA BOLTON"]
[5002,"WN","Larson","Western NY & PA Event (5002) 10% {Larson}","WN",5002,500,"Western NY & PA Event ","CITY",null,null,"BRICKER",5514,"BRICKER ALEX M","ALEX BRICKER","Check",{"$nulls":3},5434,"BOYD ROY","ROY BOYD"]
[5003,"MO","Zeigler","Monmouth OR City (5003) 15% {Zeigler}","MO",5003,500,"Monmouth OR City ","CITY",null,null,"BULL",5548,"BULL PATRICIA","PATRICIA BULL","Main",{"$nulls":3},5342,"BOYLE CHAR & T","CHARLES & TRACEY BOYLE"]
[5004,"NR","Cossette","NE Regional Mobilization  (5004) 15% {Cossette}","NR",5004,500,"NE Regional Mobilization  ","CITY",null,null,"BUNYARD",5776,"BUNYARD RONALD","RON BUNYARD","Main",{"$nulls":3},5178,"BRAINTWAIN S","STEPHEN BRAINTWAIN"]
[5005,"ET","Depalatis","Evangeline Tharp Mem. Fnd (5005) 10% {Depalatis}","ET",5005,200,"Evangeline Tharp Mem. Fnd ","CITY",null,null,"BURTON",5672,"BURTON KRISTI","KRISTI BURTON","Main",{"$nulls":3},5706,"BRANNEN","DAN & CAROLYN BRANNEN"]
[5006,"AM","Mills","Auraria Ministry (5006) 15% {Mills}","AM",5006,500,"Auraria Ministry ","CITY",null,null,"CADDELL",5784,"CADDELL ANGELA","ANGELA CADDELL","Main",{"$nulls":3},5514,"BRICKER ALEX M","ALEX and MARY BRICKER"]
[5007,"LN","Spaulding","Lincoln NE City (5007) 15% {Spaulding}","LN",5007,500,"Lincoln NE City ","CITY",null,null,"CAIN",5358,"CAIN M K","MIKE CAIN","Main",{"$nulls":3},5548,"BULL PATRICIA","PATRICIA BULL"]
[5008,"BI","Berger","Bloomington/Normal, Illinois (5008) 15% {Berger}","BI",5008,500,"Bloomington/Normal, Illinois ","CITY",null,null,"CAMOMILE",5738,"CAMOMILE J&L","LISA CAMOMILE","Main",{"$nulls":3},5776,"BUNYARD RONALD","RON BUNYARD"]
[5009,"KF","Douglass","KC Fund Raise Event (5009) 10% {Douglass}","KF",5009,500,"KC Fund Raise Event ","CITY",null,null,{"$f":"RIGHT(O39,LEN(O39)-SEARCH(\" \",O39,1))","v":"carpenter"},5713,"CARPENTER A","amber carpenter","Main",{"$nulls":3},"","BURNS LESLIE","LESLIE BURNS"]
[5010,"CS","Halverson","Colorado Springs Retreat (5010) 10% {Halverson}","CS",5010,500,"Colorado Springs Retreat ","CITY",null,null,"CARLSON",5157,"CARLSON KIMBERL","KIMMIE CARLSON","Main",{"$nulls":3},5672,"BURTON KRISTI","KRISTI BURTON"]
[5011,"SF","Thomas C","San Francisco City (5011) 15% {Thomas C}","SF",5011,500,"San Francisco City ","CITY",null,null,{"$f":"RIGHT(O41,LEN(O41)-SEARCH(\" \",O41,1))","v":"CARLSON"},5320,"EVANS WENDY","JOEL CARLSON","Main",{"$nulls":3},5566,"BURTON PAUL","PAUL BURTON"]
[5012,"NA","Downs","Northridge Area, CA (5012) 15% {Downs}","NA",5012,500,"Northridge Area, CA ","CITY",null,null,"CARROL",5560,"CARROLL S J","SAMUEL CARROL","Main",{"$nulls":3},5784,"CADDELL ANGELA","ANGELA CADDELL"]
[5013,"WN","Larson","West/Cent NY & West PA (5013) 15% {Larson}","WN",5013,500,"West/Cent NY & West PA ","CITY",null,null,"CARTER",5498,"CARTER KATY","KATY CARTER","Main",{"$nulls":3},5358,"CAIN M K","MICHAEL OR KATHRYN CAIN"]
[5014,"WM","S. Hope","Western Massachusetts Area (5014) 15% {S. Hope}","WM",5014,500,"Western Massachusetts Area ","CITY",null,null,{"$f":"RIGHT(O44,LEN(O44)-SEARCH(\" \",O44,1))","v":"& Hollie Casper"},5238,"CASPER J H","Jason & Hollie Casper","Main",{"$nulls":3},5738,"CAMOMILE J&L","Jim & Lisa Camomile"]
[5015,"BI","Hawes","Bloomington, IN Special (5015) 10% {Hawes}","BI",5015,500,"Bloomington, IN Special ","CITY",null,null,"CERMAK",5551,"CERMAK TONY","TONY CERMAK","Main",{"$nulls":3},5302,"CARLSON JOEL","JOEL CARLSON"]
[5016,"SC","Pollard","Santz Cruz Events (5016) 5%5% {Pollard}","SC",5016,500,"Santz Cruz Events ","CITY",null,null,"CHAMPOUX",5501,"CHAMPOUX G","GINNY CHAMPOUX","Main",{"$nulls":3},5157,"CARLSON KIMBERL","KIMBERLY CARLSON"]
[5017,"IC","Younkin","Iowa City (5017) 15% {Younkin}","IC",5017,500,"Iowa City ","CITY",null,null,"CHAMPOUX",5503,"CHAMPOUX L L","LARRY CHAMPOUX","Check",{"$nulls":3},5713,"CARPENTER A","Amber Carpenter"]
[5018,"NC","Pollard","Northern Cal Student Activity (5018) 15% {Pollard}","NC",5018,500,"Northern Cal Student Activity ","CITY",null,null,"CHAN",5836,"CHAN MOLLY","MOLLY CHAN","Main",{"$nulls":3},5560,"CARROLL S J","SAMUEL and JOANNE CARROLL"]
[5019,"NC","Downs","Northridge, CA Events (5019) 10% {Downs}","NC",5019,500,"Northridge, CA Events ","CITY",null,null,"CHAN",5917,"CHAN SAMUEL","SAMUEL CHAN","Main",{"$nulls":3},5498,"CARTER KATY","KATY CARTER"]
[5020,"PU","Zull","Purdue University IN (5020) 15% {Zull}","PU",5020,500,"Purdue University IN ","CITY",null,null,"CHARLIER",3100,"CHARLIER","MICKIE CHARLIER","Main",{"$nulls":3},5238,"CASPER J H","JASON AND HOLLY CASPER"]
[5021,"FC","Grove","Fayetteville City (5021) 15% {Grove}","FC",5021,500,"Fayetteville City ","CITY",null,null,"CHAU",5576,"CHAU KENNY","KENNY CHAU","Main",{"$nulls":3},5551,"CERMAK TONY","TONY AND DAYNA CERMAK"]
[5022,"TT","Manasco","Tyler Tx (5022) 15% {Manasco}","TT",5022,500,"Tyler Tx ","CITY",null,null,"CHEN",5710,"CHEN DENISE","chen, denise","Main",{"$nulls":3},5501,"CHAMPOUX G","GINNY CHAMPOUX"]
[5023,"SB","Depalatis","Sout Bay Pennisula CA  (5023) 15% {Depalatis}","SB",5023,500,"Sout Bay Pennisula CA  ","CITY",null,null,"CHEN",5684,"CHEN JENNIFER","JENNIFER CHEN","Main",{"$nulls":3},5503,"CHAMPOUX L L","LARRY & LUCY CHAMPOUX"]
[5024,"MC","Mills","Mesa Community College (5024) 15% {Mills}","MC",5024,500,"Mesa Community College ","CITY",null,null,"CHIJINDU",5448,"CHIJINDU EMM","EMMANUEL CHIJINDU","Main",{"$nulls":3},"","CHAN ANDREW","ANDREW CHAN"]
[5025,"EE","Smucker","Eugene Events (5025) 5%-5% {Smucker}","EE",5025,500,"Eugene Events ","CITY",null,null,"HANNAH",5361,"CHRISTOFER HANN","CHRISTOFER, HANNAH","Main",{"$nulls":3},5836,"CHAN MOLLY","MOLLY CHAN"]
[5026,"DC","Kronstad","Durham City Student Activity (5026) 15% {Kronstad}","DC",5026,500,"Durham City Student Activity ","CITY",null,null,"CIGANIC",5591,{"$f":"_xlfn.IFNA(VLOOKUP(M56,T:U,2,),\"\")","v":"CIGANIC ADRIAN"},"ADRIAN CIGANIC","Main",{"$nulls":3},5917,"CHAN SAMUEL","Samuel Chan"]
[5027,"IA","Spady","ID/MT Area Mobilization (5027) 15% {Spady}","IA",5027,500,"ID/MT Area Mobilization ","CITY",null,null,"CLEMENTS",5488,"CLEMENTS DARIUS","DARIUS CLEMENTS","Main",{"$nulls":3},3100,"CHARLIER","Mickie Charlier"]
[5028,"GC","Shelley","Greely CO (5028) 15% {Shelley}","GC",5028,500,"Greely CO ","CITY",null,null,"COLACO",5607,"COLACO NOEL","NOEL COLACO","Main",{"$nulls":3},5576,"CHAU KENNY","KENNY CHAU"]
[5029,"NB","Mannon","New Brunswick, NJ City (5029) 15% {Mannon}","NB",5029,500,"New Brunswick, NJ City ","CITY",null,null,"COLEMAN",5641,"COLEMAN PIXIE","PIXIE COLEMAN","Main",{"$nulls":3},5710,"CHEN DENISE","DENISE CHEN"]
[5030,"NR","Hope","NE Region TRUE Retreats (5030) 10% {Hope}","NR",5030,500,"NE Region TRUE Retreats ","CITY",null,null,{"$f":"RIGHT(O60,LEN(O60)-SEARCH(\" \",O60,1))","v":"COMPTON"},5192,"COMPTON","LAURA COMPTON","Main",{"$nulls":3},5684,"CHEN JENNIFER","JENNIFER CHEN"]
[5031,"WA","Allen","Wichita Activity Acct (5031) 15% {Allen}","WA",5031,500,"Wichita Activity Acct ","CITY",null,null,"CONGDON",5139,"CONGDON","GENE CONGDON","Main",{"$nulls":3},5448,"CHIJINDU EMM","EMMANUEL CHIJINDU"]
[5032,"KP","Douglass","KC Park University (5032) 15% {Douglass}","KP",5032,500,"KC Park University ","CITY",null,null,"Cordell",5681,"CORDELL BETH","Beth Cordell","Main",{"$nulls":3},5361,"CHRISTOFER HANN","CHRISTOFER, HANNAH"]
[5033,"PC","Newbrander","Philadelphia City (5033) 15% {Newbrander}","PC",5033,500,"Philadelphia City ","CITY",null,null,"COSSETTE",5336,"COSSETTE","RICHARD COSSETTE","Main",{"$nulls":3},5591,"CIGANIC ADRIAN","Mr. Adrian Ciganic"]
[5036,"CS","","Cossette Special (5036) 10%","CS",5036,500,"Cossette Special ","SPEC",null,null,"COTE",5628,"Cote Jennifer","JENNIFER COTE","Main",{"$nulls":3},5908,"CLAASSEN GARY","GARY CLAASSEN"]
[5037,"MS","","Miller Special Fund (5037) 10%","MS",5037,500,"Miller Special Fund ","SPEC",null,null,"COTTON",5440,"COTTON R L","RAY COTTON","Main",{"$nulls":3},5488,"CLEMENTS DARIUS","DARIUS CLEMENTS"]
[5038,"SO","","Stillwater, OK (5038) 15% (Frost}","SO",5038,500,"Stillwater, OK ","CITY",null,null,"COX",5526,"COX JOANNA","JOANNA COX","Main",{"$nulls":3},5607,"COLACO NOEL","NOEL COLACO"]
[5039,"NN","Innis","Northern NJ Area (5039) 15% {Innis}","NN",5039,500,"Northern NJ Area ","CITY",null,null,"CROWELL",5355,"CROWELL GIL","GILBERT CROWELL","Main",{"$nulls":3},5641,"COLEMAN PIXIE","FRED AND PIXIE COLEMAN"]
[5040,"WR","","Western Region True Retreat (5040) 15%","WR",5040,500,"Western Region True Retreat ","CITY",null,null,"CROWELL",5904,"CROWELL TERI","TERI CROWELL","Main",{"$nulls":3},5192,"COMPTON","Laura Compton"]
[5041,{"$f":"E69","v":"UI"},{"$f":"IFERROR(MID(D69,SEARCH(\"{\",D69,1)+1,SEARCH(\"}\",D69,1)-SEARCH(\"{\",D69,1)-1),\"\")","v":"Krehbeil"},"Urbana/Champaign, IL (5041) 15% {Krehbeil}",{"$f":"LEFT(D69,1)&MID(D69,SEARCH(\" \",D69,1)+1,1)","v":"UI"},{"$f":"A69","v":5041},500,{"$f":"LEFT(D69,SEARCH(\"(\",D69,1)-1)","v":"Urbana/Champaign, IL "},"CITY",null,null,"CUTLER",5319,"CUTLER M","MICHAEL CUTLER","Main",{"$nulls":3},5139,"CONGDON","Gene and Patty Congdon"]
[5042,"BS","","Boyle Special (5042) 10%","BS",5042,500,"Boyle Special ","SPEC",null,null,"DANIEL",5144,"DANIEL Kimberly","Kimberly Daniel","Main",{"$nulls":3},5681,"CORDELL BETH","BETH CORDELL"]
[5043,{"$f":"E71","v":"BV"},"Jackson","Blacksburg, VA (5043) 15%",{"$f":"LEFT(D71,1)&MID(D71,SEARCH(\" \",D71,1)+1,1)","v":"BV"},{"$f":"A71","v":5043},500,{"$f":"LEFT(D71,SEARCH(\"(\",D71,1)-1)","v":"Blacksburg, VA "},"CITY",null,null,"DAVID",5539,"DAVID SAM","SAM DAVID","Main",{"$nulls":3},5336,"COSSETTE","RICHARD COSSETTE"]
[5045,{"$f":"E72","v":"SS"},{"$f":"IFERROR(MID(D72,SEARCH(\"{\",D72,1)+1,SEARCH(\"}\",D72,1)-SEARCH(\"{\",D72,1)-1),\"\")","v":""},"Shelly Special (5045) 10%",{"$f":"LEFT(D72,1)&MID(D72,SEARCH(\" \",D72,1)+1,1)","v":"SS"},{"$f":"A72","v":5045},500,{"$f":"LEFT(D72,SEARCH(\"(\",D72,1)-1)","v":"Shelly Special "},"SPEC",null,null,"DECKER",5508,"DECKER","GORDY DECKER","Main",{"$nulls":3},5628,"Cote Jennifer","Jennifer Cote"]
[5046,"CS","","Cox Special (5046) 10%","CS",5046,500,"Cox Special ","SPEC",null,null,"DEMMIE",5836,"CHAN MOLLY","GLENDA DEMMIE","Main",{"$nulls":3},5440,"COTTON R L","RAY and LAURA COTTON"]
[5048,"CS","","Colo Sprgs Fund Event (5048) 5%5% Halverson}","CS",5048,500,"Colo Sprgs Fund Event ","CITY",null,null,"DEPALATIS",5787,"DEPALATIS","DALE DEPALATIS","Main",{"$nulls":3},5526,"COX JOANNA","JOANNA COX"]
[5050,"RF","","Returnee Followup Training (5050) 25%","RF",5050,200,"Returnee Followup Training ","NMF",null,null,"DESAI",5686,"DESAI","JOHN DESAI","Main",{"$nulls":3},1100,"COX KYLE","KYLE COX"]
[5051,"GC","","Global Conference ISI Vision Inst ECFA (5051) 25%","GC",5051,200,"Global Conference ISI Vision Inst ECFA ","NMF",null,null,"DICKINSON",5328,"DICKINSON BETH","BETHANY DICKINSON","Main",{"$nulls":3},"","CRAMER SHANNON","SHANNON CRAMER"]
[5053,"OD","","Overseas Directors in Key Cities --ECFA (5053) 25%","OD",5053,200,"Overseas Directors in Key Cities --ECFA ","NMF",null,null,"DICKINSON",5435,"DICKSON L P","PAM DICKINSON","Main",{"$nulls":3},2306,"CRISPELL LINDA","LINDA CRISPELL"]
[5054,"ME","","Middle Eastern Student Outreach (5054) 25%","ME",5054,200,"Middle Eastern Student Outreach ","NMF",null,null,"DODD",5743,"DODD, CHUC LISA","LISA DODD","Main",{"$nulls":3},5355,"CROWELL GIL","GILBERT CROWELL"]
[5055,"MI","","Media Initatives (5055) 25%","MI",5055,200,"Media Initatives ","NMF",null,null,"dorsch",5911,"DORSCH BOB","bob dorsch","Main",{"$nulls":3},5904,"CROWELL TERI","TERI CROWELL"]
[5057,"IS","","International Student Global Initiatie (5057) 25%","IS",5057,200,"International Student Global Initiatie ","NMF",null,null,"DORNING",5471,"DORNING","DAWN DORNING","Main",{"$nulls":3},5319,"CUTLER M","MICHAEL CUTLER"]
[5059,"UM","","Undergraduate Ministires AZ (5059) 15%","UM",5059,500,"Undergraduate Ministires AZ ","CITY",null,null,"DOUGLASS",5647,"DOUGLASS CAROL","CAROL DOUGLASS","Main",{"$nulls":3},5144,"DANIEL Kimberly","KIMBERLY DANIEL"]
[5060,"JR","","Japan Relief Fund (5060) 25%","JR",5060,200,"Japan Relief Fund ","NMF",null,null,"DOWNS",5718,"DOWNS IAN","IAN DOWNS","Main",{"$nulls":3},5539,"DAVID SAM","SAM DAVID"]
[5061,"CV","","Charlottesville, VA (5061) 15%","CV",5061,500,"Charlottesville, VA ","CITY",null,null,"DRAPER",5806,"DRAPER CHERYL","CHERYL DRAPER","Main",{"$nulls":3},5508,"DECKER","J. Gordon Decker"]
[5065,"SA","","SF Area Univ Outreach (5065) 25%","SA",5065,200,"SF Area Univ Outreach ","NMF",null,null,"DUGO",5147,"DUGO","JOHN DUGO","Main",{"$nulls":3},"","DELLINGER CARO","CAROLE DELLINGER"]
[5060,"DR","","Disaster Releif Fund (5060) 0%","DR",5060,200,"Disaster Releif Fund ","NMF",null,null,"DUNNE",5161,"DUNNE STEPHEN","STEPHEN DUNNE","Main",{"$nulls":3},5836,"DEMMIE","GLENDA & PAUL DEMMIE"]
[5070,"SB","","So. Baptist Collaboration Initiative (5070) 25%","SB",5070,200,"So. Baptist Collaboration Initiative ","NMF",null,null,{"$f":"RIGHT(O86,LEN(O86)-SEARCH(\" \",O86,1))","v":"durstenfeld "},5715,"DURSTENFELD BOB","richard durstenfeld ","Main",{"$nulls":3},5787,"DEPALATIS","DALE & CAROLYN DEPALATIS"]
[5075,"TS","","Top Strategic Initiative (5075) 25%","TS",5075,200,"Top Strategic Initiative ","NMF",null,null,"sykstra",5914,"DYKSTRA D J","judy sykstra","Main",{"$nulls":3},5686,"DESAI","JOHN DESAI"]
[5080,"IG","","ISI Global impact (5080)%","IG",5080,200,"ISI Global impact ","NMF",null,null,"EASTON",5396,"EASTON VALERIE","VALERIE EASTON","Main",{"$nulls":3},5328,"DICKINSON BETH","BETHANY DICKINSON"]
[5097,"BS","","Bevan Special (5097) 10%","BS",5097,500,"Bevan Special ","SPEC",null,null,"EGAN",5596,"EGAN","DEBORAH EGAN","Main",{"$nulls":3},5435,"DICKSON L P","LARRY AND PAMELA DICKSON"]
[5098,"HS","","Halverson Special (5098) 10%","HS",5098,500,"Halverson Special ","SPEC",null,null,"EHMANN",5239,"EHMANN GINGER","GINGER EHMANN","Main",{"$nulls":3},"","DJAN-SAMPSON E","EFUA DJAN-SAMPSON"]
[5100,"IN","","ISI National Conference (5100) 0%","IN",5100,300,"ISI National Conference ","NMF",null,null,"EILERS",5949,"EILERS ALICE","ALICE EILERS","Main",{"$nulls":3},5743,"DODD, CHUC LISA","CHARLES and LISA DODD"]
[5101,"GM","","Global Ministries (5101) 25%","GM",5101,300,"Global Ministries ","NMF",null,null,"ELISHA",5533,"ELISHA STEVE","STEVE ELISHA","Main",{"$nulls":3},5471,"DORNING","DAWN DORNING"]
[5102,"GR","","Global Returnee Education (5102) 25%","GR",5102,300,"Global Returnee Education ","NMF",null,null,"EMERY",5404,"EMERY","LESLIE EMERY","Main",{"$nulls":3},5911,"DORSCH BOB","ROBERT DORSCH"]
[5103,"ID","","Int'l Director Year 1 Seed Money (5103) 0%","ID",5103,300,"Int'l Director Year 1 Seed Money ","NMF",null,null,"EVANS",5320,"EVANS WENDY","WENDY EVANS","Main",{"$nulls":3},"","DOUGLAS LEE","LEE DOUGLAS"]
[5104,"KR","","Katrina Relief (5104) 0%","KR",5104,300,"Katrina Relief ","NMF",null,null,"FANNIN",5175,"FANNIN","KEVIN FANNIN","Main",{"$nulls":3},5647,"DOUGLASS CAROL","CAROL DOUGLASS"]
[5105,"NS","","National Staff Conference (5105) 0%","NS",5105,300,"National Staff Conference ","NMF",null,null,"FATTY",5580,"FATTY SAINEY","SAINEY FATTY","Main",{"$nulls":3},5718,"DOWNS IAN","IAN DOWNS"]
[5106,"SW","","Student Website Design Costs (5106) 25%","SW",5106,300,"Student Website Design Costs ","NMF",null,null,"FLAMMINI",5563,"FLAMMINI S S","STEVE FLAMMINI","Main",{"$nulls":3},5806,"DRAPER CHERYL","CHERYL DRAPER"]
[5107,"WC","","Web Coordinator (5107) 25%","WC",5107,300,"Web Coordinator ","NMF",null,null,"FLYNN",5720,"FLYNN PATRICK","PATRICK FLYNN","Main",{"$nulls":3},5147,"DUGO","JOHN & JANET DUGO"]
[5108,"MF","","Memorial Fund (5108) 10%","MF",5108,300,"Memorial Fund ","NMF",null,null,"FORD",5544,"FORD ANDREA","ANDREA FORD","Main",{"$nulls":3},5161,"DUNNE STEPHEN","STEPHEN DUNNE"]
[5109,"C(","","Cumulus9 (5109) 25%","C(",5109,300,"Cumulus9 ","NMF",null,null,"FOTI",5231,"FOTI VICKY","VICKY FOTI","Main",{"$nulls":3},5715,"DURSTENFELD BOB","Bob Durstenfeld"]
[5111,"PM","","Ponten, Mary Jane (5111)8.5%","PM",5111,500,"Ponten, Mary Jane ","REG",null,null,"FRAMBES",5527,"FRAMBES K L","KIRK FRAMBES","Main",{"$nulls":3},5914,"DYKSTRA D J","DOUG AND JUDY DYKSTRA"]
[5112,"MF","Zeigler","Memorial Fund - Elcho Redding (5112) 0% {Zeigler}","MF",5112,300,"Memorial Fund - Elcho Redding ","SPEC",null,null,"FRIESEN",5163,"FRIESEN J","JULIE FRIESEN","Main",{"$nulls":3},5396,"EASTON VALERIE","EASTON, VALERIE"]
[5113,"MP","","Martha Peterson Memorial Fund (5113) 15%","MP",5113,500,"Martha Peterson Memorial Fund ","SPEC",null,null,"FROST",5307,"FROST JIM","JIM FROST","Main",{"$nulls":3},5596,"EGAN","DEBORAH EGAN"]
[5114,"RE","","Roelof Engelbrecht Memorial Fund (5114) 15%","RE",5114,500,"Roelof Engelbrecht Memorial Fund ","SPEC",null,null,"GENGLER",5455,"","TOM GENGLER","Main",{"$nulls":3},5239,"EHMANN GINGER","GINGER EHMANN"]
[5115,"SS","","Singapore Seminar (5115) 0%","SS",5115,300,"Singapore Seminar ","NMF",null,null,"GERMANN",5695,"GERMANN ED V","ED GERMANN","Main",{"$nulls":3},5949,"EILERS ALICE","ALICE EILERS"]
[5116,"SS","","Singapore Staff Conference (5116) 0%","SS",5116,300,"Singapore Staff Conference ","NMF",null,null,"GHIMIRE",5232,"GHIMIRE A S","ASHOK GHIMIRE","Main",{"$nulls":3},5533,"ELISHA STEVE","STEVE ELISHA"]
[5117,"DD","","Donor Database System (5117) 25%","DD",5117,300,"Donor Database System ","NMF",null,null,"GODDARD",5148,"GODDARD, J","JANICE GODDARD","Main",{"$nulls":3},5404,"EMERY","WAYNE & LESLEY EMERY"]
[5118,"DM","","Direct Mail Development (5118) 25%","DM",5118,300,"Direct Mail Development ","NMF",null,null,"GODWIN",5383,"GODWIN ELIZABET","LIZ GODWIN","Main",{"$nulls":3},5320,"EVANS WENDY","Wendy Evans"]
[5119,"WT","","Website Training Project (5119) 25%","WT",5119,300,"Website Training Project ","NMF",null,null,"GOLD",5512,"GOLD TIMOTHY","TIMOTHY GOLD","Main",{"$nulls":3},5175,"FANNIN","KEVIN & HEATHER FANNIN"]
[5120,"CS","","Counseling/FLD Staff (5120) 0%","CS",5120,300,"Counseling/FLD Staff ","NMF",null,null,"GOLL",5505,{"$f":"_xlfn.IFNA(VLOOKUP(M110,T:U,2,),\"\")","v":"GOLL J S"},"JOE GOLL","Main",{"$nulls":3},5580,"FATTY SAINEY","SAINEY FATTY"]
[5121,"ST","","Specialized Training Project (5121) 25%","ST",5121,300,"Specialized Training Project ","NMF",null,null,"GRAY",5214,"GRAY MARK","MARK GRAY","Main",{"$nulls":3},3100,"FINCK RASHAE","Rashae Finck"]
[5122,"PV","","Princeton Video Work (5122) 25%","PV",5122,300,"Princeton Video Work ","NMF",null,null,"GREEN",5542,"GREEN COURTNEY","SAM GREEN","Main",{"$nulls":3},5690,"FITZGERALD","ROBERT FITZGERALD"]
[5123,"Rt","","Rock the Nations 2004 (5123) 25%","Rt",5123,300,"Rock the Nations 2004 ","NMF",null,null,"GROVE",5562,"GROVE ANDREW","ANDY GROVE","Main",{"$nulls":3},5563,"FLAMMINI S S","FLAMMINI, Steve & Sandra"]
[5124,"NS","Althouse","NYC Student Internship (5124) 15% {Althouse}","NS",5124,500,"NYC Student Internship ","CITY",null,null,"GUNDERSON",5557,"GUNDERSON PAUL","PAUL GUNDERSON","Main",{"$nulls":3},5720,"FLYNN PATRICK","Patrick Flynn"]
[5125,"CM","","Church/Vol Mob (5125) 25%","CM",5125,300,"Church/Vol Mob ","NMF",null,null,"Haddock",5688,"Haddock de Jesu","Stephanie Haddock","Main",{"$nulls":3},5544,"FORD ANDREA","ANDREA FORD"]
[5127,"PD","","Parkins, Daniel (5127) 15%","PD",5127,500,"Parkins, Daniel ","REG",null,null,{"$f":"RIGHT(O116,LEN(O116)-SEARCH(\" \",O116,1))","v":"HADLEY"},5386,"HADLEY","BUELL HADLEY","Main",{"$nulls":3},5231,"FOTI VICKY","VICKY FOTI"]
[5129,"CM","","China Ministries (5129) 25%","CM",5129,300,"China Ministries ","NMF",null,null,"Haislip",5656,"HAISLIP KEVIN","Kevin Haislip","Main",{"$nulls":3},5527,"FRAMBES K L","KIRK AND LINDA FRAMBES"]
[5130,"ND","","Nat Dir Fld Team Min (5130) 15%","ND",5130,300,"Nat Dir Fld Team Min ","NMF",null,null,"HAKES",5263,"HAKES HANNAH","HANNAH HAKES","Main",{"$nulls":3},5163,"FRIESEN J","JULIE FRIESEN"]
[5132,"EI","","Equip Initiatives (5132) 25%","EI",5132,300,"Equip Initiatives ","NMF",null,null,"HALFERTY",5763,"HALFERTY SARAH","SARAH HALFERTY","Main",{"$nulls":3},5307,"FROST JIM","JIM FROST"]
[5134,"O(","","Orientation/Training (5134) 0%","O(",5134,300,"Orientation/Training ","NMF",null,null,"HALLIGAN",5594,"HALLIGAN","LIZ HALLIGAN","Main",{"$nulls":3},5695,"GERMANN ED V","Ed and Vicki Germann"]
[5136,"PA","","Pearce, Andy (5136) 15%","PA",5136,500,"Pearce, Andy ","REG",null,null,"HALVERSON",5198,"HALVERSON","DEAN HALVERSON","Main",{"$nulls":3},5232,"GHIMIRE A S","ASHOK AND SABINA GHIMIRE"]
[5137,"PS","","Pearce Special (5137) 10%","PS",5137,500,"Pearce Special ","SPEC",null,null,"HANSEN",5552,"HANSEN RANDY","RANDY HANSEN","Main",{"$nulls":3},5148,"GODDARD, J","JANICE GODDARD"]
[5138,"CS","","Congdon Special (5138)10%","CS",5138,500,"Congdon Special ","SPEC",null,null,"HARGREAVE",5593,"HARGREAVES","SHEILA HARGREAVE","Main",{"$nulls":3},5383,"GODWIN ELIZABET","ELIZABETH and PAUL GODWIN"]
[5139,"CG","","Congdon, Gene (5139) 15%","CG",5139,500,"Congdon, Gene ","REG",null,null,"Harms",5759,"HARMS JOE","JOE Harms","Main",{"$nulls":3},5512,"GOLD TIMOTHY","TIMOTHY GOLD"]
[5141,"AJ","","Alumbaugh, Jon & Ruth (5141) min rep 15%","AJ",5141,500,"Alumbaugh, Jon & Ruth ","REG",null,null,"HARPER",5912,"HARPER","LEON HARPER","Main",{"$nulls":3},5505,"GOLL J S","JOSEPH & SHERYL GOLL"]
[5142,"KM","","Kaneshiro, Melanie (5142) MR 15%","KM",5142,500,"Kaneshiro, Melanie ","REG",null,null,"HAWES",5220,"HAWES RANDY","RANDY HAWES","Main",{"$nulls":3},"","GOTTLOB DAVE","DAVE GOTTLOB"]
[5143,"JS","","Jackson, Sandra & Bob (5143) 15%","JS",5143,500,"Jackson, Sandra & Bob ","REG",null,null,"HAWKINS",5575,"HAWKINS","SCOTT HAWKINS","Main",{"$nulls":3},5214,"GRAY MARK","MARK OR SHERIDA GRAY"]
[5144,"DK","","Daniel, Kimberly (5144) 15%","DK",5144,500,"Daniel, Kimberly ","REG",null,null,"HELMEN",5407,"HELMEN JERRY","JERRY HELMEN","Main",{"$nulls":3},5542,"GREEN COURTNEY","SAM & COURTNEY GREEN"]
[5145,"AJ","","Ainsworth, Jacob (5145) 15%","AJ",5145,500,"Ainsworth, Jacob ","REG",null,null,"HERHOLZ",5750,"HERHOLZ A S","Shaun Herholz","Main",{"$nulls":3},5562,"GROVE ANDREW","ANDREW E GROVE"]
[5146,"MS","","Mathew, Subhash (5146) 15%","MS",5146,500,"Mathew, Subhash ","REG",null,null,"Herman",5679,"HERMAN JAMIESON","Jamieson Herman","Main",{"$nulls":3},5557,"GUNDERSON PAUL","PAUL GUNDERSON"]
[5147,"DJ","","Dugo, John & Janet (5147) min rep 15%","DJ",5147,500,"Dugo, John & Janet ","REG",null,null,{"$f":"RIGHT(O131,LEN(O131)-SEARCH(\" \",O131,1))","v":"Herring"},5712,"HERRING RICHARD","Richard Herring","Main",{"$nulls":3},"","GWEE","DEREK GWEE"]
[5148,"GJ","","Goddard, Janice (5148) min rep 15%","GJ",5148,500,"Goddard, Janice ","REG",null,null,"HERSHBERGER",5378,"HERSHBERGER MIC","MICHAEL HERSHBERGER","Main",{"$nulls":3},5688,"Haddock de Jesu","Stephanie Haddock de Jesus"]
[5150,"5A","","50th Anniversary Fundraising Init. (5150) 25%","5A",5150,500,"50th Anniversary Fundraising Init. ","NMF",null,null,"HODGES",5346,"HODGES I E","ISABEL HODGES","Main",{"$nulls":3},5386,"HADLEY","BUELL AND BARBARA HADLEY"]
[5152,"S[","","Satoh [Ogata], Miwa (5152) min rep 15%","S[",5152,500,"Satoh [Ogata], Miwa ","REG",null,null,"HOLBROOK",5755,"HOLBROOK LON","Lon Holbrook","Main",{"$nulls":3},5656,"HAISLIP KEVIN","KEVIN HAISLIP"]
[5153,"LM","","Lempenau, Michael (5153) min rep 15%","LM",5153,500,"Lempenau, Michael ","REG",null,null,"HOLLAND","3300ch","HOLLAND CHRISTI","CHRISTINE HOLLAND","Main",{"$nulls":3},5263,"HAKES HANNAH","HANNAH HAKES"]
[5154,"RB","","Roberts, Bill & Bel (5154) 15%","RB",5154,500,"Roberts, Bill & Bel ","REG",null,null,"HOPE",5350,"HOPE N","STEPHEN HOPE","Main",{"$nulls":3},5763,"HALFERTY SARAH","SARAH HALFERTY"]
[5155,"MK","","Marques, Karol (5155) min rep 15%","MK",5155,500,"Marques, Karol ","REG",null,null,"HOPE",5350,"HOPE N","TASH HOPE","Main",{"$nulls":3},5594,"HALLIGAN","Dale Halligan"]
[5156,"AJ","","Arant, Julie (5156) min rep 15%","AJ",5156,500,"Arant, Julie ","REG",null,null,"HUFF",5199,"HUFF DANA","DANA HUFF","Main",{"$nulls":3},5198,"HALVERSON","DEAN HALVERSON"]
[5157,"CK","","Carlson, Kimberly (5157) 15%","CK",5157,500,"Carlson, Kimberly ","REG",null,null,"HUSTON",5600,"HUSTON RICHARD","RICHARD HUSTON","Main",{"$nulls":3},5552,"HANSEN RANDY","Randy Hansen"]
[5158,"BJ","","Boitz, Joy Alynn [Curtis] (5158) min rep 15%","BJ",5158,500,"Boitz, Joy Alynn [Curtis] ","REG",null,null,"INGRAM",5452,"INGRAM RONALD","RONALD INGRAM","Main",{"$nulls":3},5593,"HARGREAVES","HARGREAVES, SHEILA"]
[5160,"LB","","LaShelle, Brett (5160) 15%","LB",5160,500,"LaShelle, Brett ","REG",null,null,"INNIS",5574,"INNIS SHIRLEY","SHIRLEY INNIS","Main",{"$nulls":3},5759,"HARMS JOE","JOE HARMS"]
[5161,"DS","","Dunne, Stephen & Lia (5161) min rep 15%","DS",5161,500,"Dunne, Stephen & Lia ","REG",null,null,"JACKSON",5783,"JACKSON D P","DERRAH JACKSON","Main",{"$nulls":3},5912,"HARPER","LEON HARPER"]
[5162,"TW","","Thomas, William [Calen] (5162) 15%","TW",5162,500,"Thomas, William [Calen] ","REG",null,null,"JACKSON",5143,"JACKSON R S","ROBERT JACKSON","Main",{"$nulls":3},3300,"HAVEN BREANNE","BREANNE HAVEN"]
[5163,{"$f":"E144","v":"FJ"},{"$f":"IFERROR(MID(D144,SEARCH(\"{\",D144,1)+1,SEARCH(\"}\",D144,1)-SEARCH(\"{\",D144,1)-1),\"\")","v":""},"Friesen, Julie (5163) Min Rep 15%",{"$f":"LEFT(D144,1)&MID(D144,SEARCH(\" \",D144,1)+1,1)","v":"FJ"},{"$f":"A144","v":5163},500,{"$f":"LEFT(D144,SEARCH(\"(\",D144,1)-1)","v":"Friesen, Julie "},"REG",null,null,"Jaletta",5693,"JALETTA BLEN","Blen Jaletta","Main",{"$nulls":3},5220,"HAWES RANDY","Randy Hawes"]
[5164,"TC","","Training Conf Acct (5164) 0%","TC",5164,300,"Training Conf Acct ","NMF",null,null,"JANG",5196,"JANG NORMAN","NORMAN JANG","Main",{"$nulls":3},5575,"HAWKINS","SCOTT HAWKINS"]
[5165,"LT","","Leadership Training (5165) 25%","LT",5165,200,"Leadership Training ","NMF",null,null,"JANTZ",3200,"JANTZ SHELDON","SHELDON JANTZ","Main",{"$nulls":3},5407,"HELMEN JERRY","JERRY HELMEN"]
[5166,"NT","","Nat'l Trng Acct Decker (5166) 0%","NT",5166,200,"Nat'l Trng Acct Decker ","NMF",null,null,"greg",5927,"JOHNSON GREG L","Johnson greg","Main",{"$nulls":3},5750,"HERHOLZ A S","ANDREEA and SHAUN HERHOLZ"]
[5167,"ZA","","Zhang, Abraham (5167) 15%","ZA",5167,500,"Zhang, Abraham ","REG",null,null,"JOSEPH",5572,"JOSEPH SABU","SABU JOSEPH","Main",{"$nulls":3},5679,"HERMAN JAMIESON","Jamieson Herman"]
[5168,"LR","","Larson, Ruth (5168) min rep 15%","LR",5168,500,"Larson, Ruth ","REG",null,null,"KANESHIRO",5142,"KANESHIRO","DAVID KANESHIRO","Main",{"$nulls":3},5712,"HERRING RICHARD","RICHARD HERRING"]
[5170,"SR","","Spaulding, Ron & Judy (5170) 15%","SR",5170,500,"Spaulding, Ron & Judy ","REG",null,null,"KENDAGOR",5613,"KENDAGOR","SOLOMON KENDAGOR","Main",{"$nulls":3},5378,"HERSHBERGER MIC","MICHAEL HERSHBERGER"]
[5171,"SS","","Spaulding Special (5171) 10%","SS",5171,500,"Spaulding Special ","SPEC",null,null,"KERSHAW",5195,"KERSHAW","PATRICIA KERSHAW","Main",{"$nulls":3},"","HIRSCH TOM","TOM HIRSCH"]
[5172,"HR","","Heder, Robert (5172) min rep 15%","HR",5172,500,"Heder, Robert ","REG",null,null,"CHEOL KIM",5181,"KIM IN CHEOL","IN CHEOL KIM","Main",{"$nulls":3},5346,"HODGES I E","ISABEL & ERIC HODGES"]
[5173,"PN","","Parlett, Nancy (5173) 15%","PN",5173,500,"Parlett, Nancy ","REG",null,null,"KINDERMANN",5351,"KINDERMANN LIS","LISA KINDERMANN","Main",{"$nulls":3},5755,"HOLBROOK LON","Lonnie Holbrook"]
[5174,"FG","","Frahm, George (5174) min rep 15%","FG",5174,500,"Frahm, George ","REG",null,null,"KOLSTAD",5658,"KOLSTAD JAN","DAVE KOLSTAD","Main",{"$nulls":3},"3300CH","HOLLAND CHRISTI","CHRISTINE HOLLAND"]
[5175,"FK","","Fannin, Kevin & Heather (5175) 15%","FK",5175,500,"Fannin, Kevin & Heather ","REG",null,null,"Kopp",5922,"KOPP ROB","Rob Kopp","Main",{"$nulls":3},5350,"HOPE N","Natasha Hope"]
[5176,"FS","","Fannin Special (5176) 10%","FS",5176,500,"Fannin Special ","SPEC",null,null,"KRAGBE",5395,"KRAGBE LISA","LISA KRAGBE","Main",{"$nulls":3},5350,"HOPE S","STEPHEN HOPE"]
[5178,"BS","","Braintwain, Steve (5178) 15%","BS",5178,500,"Braintwain, Steve ","REG",null,null,"KREHBIEL",5794,"KREHBIEL","DAVID KREHBIEL","Main",{"$nulls":3},5199,"HUFF DANA","MR. DANA HUFF"]
[5179,"BS","","Braintwain Special (5179) 10%","BS",5179,500,"Braintwain Special ","SPEC",null,null,"KRONSTAD",5212,{"$f":"_xlfn.IFNA(VLOOKUP(M158,T:U,2,),\"\")","v":"KRONSTAD DANIEL"},"DANIEL KRONSTAD","Main",{"$nulls":3},5600,"HUSTON RICHARD","Richard Huston"]
[5181,"KI","","Kim, In Cheol [Aquila] (5181) 15%","KI",5181,500,"Kim, In Cheol [Aquila] ","REG",null,null,"Lackey",5671,"LACKEY HEATHER","Heather, Lackey","Main",{"$nulls":3},3100,"HYATT JEFF","JEFF HYATT"]
[5183,"NB","","Ng, Boon-Kjhai (5183) 15%","NB",5183,500,"Ng, Boon-Kjhai ","REG",null,null,"LAHTI",5262,"LAHTI KRISTEN","KRISTEN LAHTI","Main",{"$nulls":3},5452,"INGRAM RONALD","RONALD INGRAM"]
[5188,"OP","","Olcott, Pat (5188) min rep 15%","OP",5188,500,"Olcott, Pat ","REG",null,null,"LAM",5740,"LAM HON","HON LAM","Main",{"$nulls":3},5574,"INNIS SHIRLEY","SHIRLEY INNIS"]
[5192,"CL","","Compton, Laura (5192)  15%","CL",5192,500,"Compton, Laura ","REG",null,null,"LAM",5309,"LAM P A","PHYLLIS LAM","Main",{"$nulls":3},5783,"JACKSON D P","DERRAH and PAM JACKSON"]
[5193,"CS","","Compton Special (5193) 10%","CS",5193,500,"Compton Special ","SPEC",null,null,{"$f":"RIGHT(O163,LEN(O163)-SEARCH(\" \",O163,1))","v":"Langford"},5726,"LANGFORD LEZ","Lezlie Langford","Main",{"$nulls":3},5143,"JACKSON R S","ROBERT  & SANDRA JACKSON"]
[5195,"KP","","Kershaw, Pat (5195) 10%","KP",5195,500,"Kershaw, Pat ","REG",null,null,"LAPINSKI",5567,"LAPINSKI ANGEL","ANGELA LAPINSKI","Main",{"$nulls":3},5693,"JALETTA BLEN","BLEN JALETTA"]
[5196,"JN","","Jang, Norm (5196) 15% Min Rep","JN",5196,500,"Jang, Norm ","REG",null,null,"LARSON",5537,"lARSON D B","DAVID LARSON","Main",{"$nulls":3},5196,"JANG NORMAN","NORMAN JANG"]
[5197,"WS","","Woods, Scott (5197) Min Rep 15%","WS",5197,500,"Woods, Scott ","REG",null,null,"LARSON,R",5168,"LARSON, RUTH","RUTH LARSON,R","Main",{"$nulls":3},3200,"JANTZ SHELDON","SHELDON JANTZ"]
[5198,"HD","","Halverson, Dean (5198) 10%","HD",5198,500,"Halverson, Dean ","REG",null,null,"LaShelle",5160,"LaShelle Brett","Brett LaShelle","Main",{"$nulls":3},5927,"JOHNSON GREG L","GREG and LIZ JOHNSON"]
[5199,"HD","","Huff, Dana [Russell] (5199) 15%","HD",5199,500,"Huff, Dana [Russell] ","REG",null,null,"LASSITER",5649,"LASSITER J R","JORDAN LASSITER","Main",{"$nulls":3},5572,"JOSEPH SABU","Sabu Joseph"]
[5200,"EP","","ESL/CSL Program (5200) 25%","EP",5200,200,"ESL/CSL Program ","NMF",null,null,"LAWECKI",5449,"LAWECKI_P","PHYLLIS LAWECKI","Main",{"$nulls":3},5142,"KANESHIRO","DAVID & MELANIE KANESHIRO"]
[5201,"Bo","","Board of Trustees (5201) 0%","Bo",5201,200,"Board of Trustees ","NMF",null,null,"LEAVISTER",5492,"LEAVISTER MARGA","MARGARET LEAVISTER","Main",{"$nulls":3},5613,"KENDAGOR","SOLOMON KENDAGOR"]
[5202,"FC","","Ft. Collins Student Scholarships (5202) 0%","FC",5202,500,"Ft. Collins Student Scholarships ","CITY",null,null,"LEE,E",5956,"LEE EVA","EVA LEE,E","Main",{"$nulls":3},5195,"KERSHAW","PATRICIA KERSHAW"]
[5205,"BF","","Benevolence Fund (5205) 0%","BF",5205,300,"Benevolence Fund ","NMF",null,null,"LeePaul",5907,"LEE PAUL NAN","Nancy LeePaul","Main",{"$nulls":3},5181,"KIM IN CHEOL","IN CHEOL KIM"]
[5207,"AE","","Adidjaja, Elgeritte (5207) Min Rep 15%","AE",5207,500,"Adidjaja, Elgeritte ","REG",null,null,{"$f":"RIGHT(O173,LEN(O173)-SEARCH(\" \",O173,1))","v":"LEUNG"},5315,"LEUNG S","STEPHEN LEUNG","Main",{"$nulls":3},5351,"KINDERMANN LIS","LISA KINDERMANN"]
[5208,"SD","","Sodergren, David (5208) 15%","SD",5208,500,"Sodergren, David ","REG",null,null,"LIGHTHALL",2101,"BOLTON TERESA","JENNIFER LIGHTHALL","Main",{"$nulls":3},5658,"KOLSTAD JAN","JAN & DAVE KOLSTAD"]
[5209,"SS","","Sodergren, Special (5209) 10%","SS",5209,500,"Sodergren, Special ","SPEC",null,null,"LIM",5398,"LIM D","DANNY LIM","Main",{"$nulls":3},5922,"KOPP ROB","ROBERT KOPP"]
[5210,"AD","","Apgar, Don & Sue (5210) 15%","AD",5210,500,"Apgar, Don & Sue ","REG",null,null,{"$f":"RIGHT(O176,LEN(O176)-SEARCH(\" \",O176,1))","v":"Lindvall"},5321,"LINDVALL","EMILY Lindvall","Main",{"$nulls":3},5395,"KRAGBE LISA","KRAGBE, LISA"]
[5211,"AS","","Apgar Special (5211) 10%","AS",5211,500,"Apgar Special ","SPEC",null,null,"LIVINGSTON",5260,"LIVINGSTON","JOHN LIVINGSTON","Main",{"$nulls":3},5794,"KREHBIEL","DAVID KREHBIEL"]
[5212,"KD","","Kronstad, Daniel (5212) 15%","KD",5212,500,"Kronstad, Daniel ","REG",null,null,"AND TOSHIKO LOCKWOOD",5411,"LOCKWOOD D T","DAN AND TOSHIKO LOCKWOOD","Main",{"$nulls":3},5212,"KRONSTAD DANIEL","DANIEL KRONSTAD"]
[5213,"KS","","Kronstad Special (5213) 15%","KS",5213,500,"Kronstad Special ","SPEC",null,null,"LOH",5442,"LOH JOEL","JOEL LOH","Main",{"$nulls":3},5671,"LACKEY HEATHER","HEATHER LACKEY"]
[5214,"GM","","Gray, Mark (5214) 15%","GM",5214,500,"Gray, Mark ","REG",null,null,{"$f":"RIGHT(O180,LEN(O180)-SEARCH(\" \",O180,1))","v":"Mammadov"},5536,"Mammadov","AMY Mammadov","Main",{"$nulls":3},5262,"LAHTI KRISTEN","KRISTEN LAHTI"]
[5215,"GS","","Gray Special (5215) 10%","GS",5215,500,"Gray Special ","SPEC",null,null,"Moudi ",5707,"MAHMOUDI MOHAM","Mohammad Moudi ","Main",{"$nulls":3},5740,"LAM HON","HON LAM"]
[5217,"vO","","van Ouwerkerk, Ed & Margreet (5217) 15%","vO",5217,500,"van Ouwerkerk, Ed & Margreet ","REG",null,null,"MAKIN",5643,"MAKIN S C","STEVE MAKIN","Main",{"$nulls":3},5309,"LAM P A","Phyllis & Abel Lam"]
[5219,"MJ","","Mitchell, Jill (5219) min rep 15%","MJ",5219,500,"Mitchell, Jill ","REG",null,null,"MANEEVONE",5701,"MANEEVONE","WICHIT MANEEVONE","Main",{"$nulls":3},5726,"LANGFORD LEZ","Lezlie Langford"]
[5220,"HR","","Hawes, Randy (5220) 15%","HR",5220,500,"Hawes, Randy ","REG",null,null,"MANNON",5353,"MANNON DAVID","DAVID MANNON","Main",{"$nulls":3},5567,"LAPINSKI ANGEL","ANGELA LAPINSKI"]
[5221,"TE","","Thomas, Erv (5221) 15%","TE",5221,500,"Thomas, Erv ","REG",null,null,"MANTA",5453,"MANTA DON","DON MANTA","Main",{"$nulls":3},5537,"lARSON D B","DAVID & BETH LARSON"]
[5222,"CS","","Carr, Sylvia (5222) 8.5%","CS",5222,500,"Carr, Sylvia ","REG",null,null,"MARQUEZ",5155,"MARQUEZ KAROL","KAROL MARQUEZ","Main",{"$nulls":3},5168,"LARSON, RUTH","RUTH LARSON"]
[5224,"TC","","Trautman, Connie (5224) min rep 15%","TC",5224,500,"Trautman, Connie ","REG",null,null,"MARSHALL",5774,"MARSHALL K J","KENT MARSHALL","Main",{"$nulls":3},"","LASCHE JOAN","Joan Lasche"]
[5225,"CD","","Chun, David (5225) 15%","CD",5225,500,"Chun, David ","REG",null,null,"MATHENY",5636,"Matheny Scott K","SCOTT MATHENY","Main",{"$nulls":3},5160,"LaShelle Brett","Brett LaShelle"]
[5227,"SJ","","Stewart, Jerilyn (5227) min rep15%","SJ",5227,500,"Stewart, Jerilyn ","REG",null,null,"Mathew",5146,"Mathew Subhash","Subhash Mathew","Main",{"$nulls":3},5747,"LASHER TRACE","TRACE LASHER"]
[5230,"CJ","","Casper, Jason (5230) 15%","CJ",5230,500,"Casper, Jason ","REG",null,null,"MCKAIN",5314,"MCKAIN REBECCA","REBECCA MCKAIN","Main",{"$nulls":3},5649,"LASSITER J R","LASSITER, JORDAN and REBEKAH"]
[5231,"FV","","Foti, Vicky (5231) 15%","FV",5231,500,"Foti, Vicky ","REG",null,null,{"$f":"RIGHT(O191,LEN(O191)-SEARCH(\" \",O191,1))","v":"Menge"},5737,"MENGE SARAH","Sarah Menge","Main",{"$nulls":3},5449,"LAWECKI_P","Phyllis Lawecki"]
[5232,"GA","","Ghimire, Ashok (5232) 15% min rep","GA",5232,500,"Ghimire, Ashok ","REG",null,null,"MEULI",3300,"HAVEN BREANNE","JENNIFER MEULI","Main",{"$nulls":3},5492,"LEAVISTER MARGA","MARGARET LEAVISTER"]
[5237,"vO","","van Ouwerkerk Special (5237) 10%","vO",5237,500,"van Ouwerkerk Special ","SPEC",null,null,"MILLER",5465,"MILLER, GAYLE/R","GAYLE MILLER","Main",{"$nulls":3},5956,"LEE EVA","Eva Lee"]
[5238,"CH","","Casper, Hollie & Jason (5238) 15%","CH",5238,500,"Casper, Hollie & Jason ","REG",null,null,"MILLER",2600,"MILLER, REBEKAH","REBEKAH MILLER","Main",{"$nulls":3},"","LEE GIDEON","GIDEON LEE"]
[5239,"EG","","Ehman, Ginger (5239) 15%","EG",5239,500,"Ehman, Ginger ","REG",null,null,"MILLS,R",5751,"Mills, Ron & Be","RON MILLS,R","Main",{"$nulls":3},"","LEE HYUNJUNG","HYUNJUNG LEE"]
[5240,"CO","","Canada Office (5240) 5%","CO",5240,500,"Canada Office ","REG",null,null,"MILLS,J",5638,"Mills Jessica","JESSICA MILLS,J","Main",{"$nulls":3},5907,"LEE PAUL NAN","Nancy Lee Paul"]
[5243,"CO","Exec","Campus Outreach Program (5243) 25%{Exec}","CO",5243,200,"Campus Outreach Program ","NMF",null,null,"MITCHELL",5219,"MITCHELL, J/M","JILL MITCHELL","Main",{"$nulls":3},5315,"LEUNG S","STEPHEN LEUNG"]
[5244,"LA","Exec","Level A Strategic Ministry Initiatives (5244) {Exec}0%","LA",5244,300,"Level A Strategic Ministry Initiatives ","NMF",null,null,"MOSELEY",5387,"LINDSEY","JENNIFER MOSELEY","Main",{"$nulls":3},"","LIANG JIANYONG","Jianyong Liang"]
[5245,"A(","Exec","Affil/Assoc (5245) 25% {Exec}","A(",5245,300,"Affil/Assoc ","NMF",null,null,"MOSHER",5482,"MOSHER, CRAIG","CRAIG MOSHER","Main",{"$nulls":3},2101,"LIGHTHALL JENNI","JENNIFER LIGHTHALL"]
[5249,"Da","Exec","Development and Mobilization (5249) 25%{Exec}","Da",5249,200,"Development and Mobilization ","NMF",null,null,{"$f":"RIGHT(O200,LEN(O200)-SEARCH(\" \",O200,1))","v":"Moynihan"},5728,"MOYNIHAN","Wendy Moynihan","Main",{"$nulls":3},5398,"LIM D","DANNY LIM"]
[5250,"Ot","","Outreach to Intl (5250) 0%","Ot",5250,100,"Outreach to Intl ","NMF",null,null,"MULL",5480,"Mull, ANDY","ANDY MULL","Main",{"$nulls":3},"","LIN JOHN","JOHN LIN"]
[5250,"Ot","","Outreach to Intl (5250) 0%","Ot",5250,100,"Outreach to Intl ","NMF",null,null,"MURCHISON",5436,"MURCHISON MARC","MARC MURCHISON","Main",{"$nulls":3},5387,"LINDSEY","JENNIFER LINDSEY"]
[5255,"AD","Exec","Allocated Distribution Fund (5255) 15% {Exec}","AD",5255,300,"Allocated Distribution Fund ","NMF",null,null,"NELSON",5311,"NELSON","JEFF NELSON","Main",{"$nulls":3},5321,"LINDVALL","EMILY LINDVALL"]
[5256,"EO","Exec","Evangelistic Outreach Events (5256) 25%{Exec}","EO",5256,200,"Evangelistic Outreach Events ","NMF",null,null,"NEWBRANDER",5427,"NEWBRANDER, JAC","TIM NEWBRANDER","Main",{"$nulls":3},5260,"LIVINGSTON","John Livingston"]
[5258,"CP","Exec","CMI Phase 6 (5258) 25%{Exec}","CP",5258,200,"CMI Phase 6 ","NMF",null,null,"NEWPHER",5428,"NEWPHER,","JEFFREY NEWPHER","Main",{"$nulls":3},5411,"LOCKWOOD D T","DAN AND TOSHIKO LOCKWOOD"]
[5259,"EC","Exec","Expanding Church Mobilization (5259) 15%{Exec}","EC",5259,300,"Expanding Church Mobilization ","NMF",null,null,"BOON-KHAI",5183,{"$f":"_xlfn.IFNA(VLOOKUP(M206,T:U,2,),\"\")","v":"NG, BOON-KHAI"},"NG, BOON-KHAI","Main",{"$nulls":3},5442,"LOH JOEL","JOEL LOH"]
[5260,"LJ","","Livingston, John (5260) 15%","LJ",5260,500,"Livingston, John ","REG",null,null,"NG",5439,"NG, JOANNA","JOANNA NG","Main",{"$nulls":3},"","LYNIP S K","STEVE AND KAREN LYNIP"]
[5261,{"$f":"E208","v":"LS"},{"$f":"IFERROR(MID(D208,SEARCH(\"{\",D208,1)+1,SEARCH(\"}\",D208,1)-SEARCH(\"{\",D208,1)-1),\"\")","v":""},"Livingston Special (5261) 10%",{"$f":"LEFT(D208,1)&MID(D208,SEARCH(\" \",D208,1)+1,1)","v":"LS"},{"$f":"A208","v":5261},500,{"$f":"LEFT(D208,SEARCH(\"(\",D208,1)-1)","v":"Livingston Special "},"SPEC",null,null,"NORDTVEDT",5393,"NORDTVEDT, JOEL","JOEL NORDTVEDT","Main",{"$nulls":3},3100,"MACDOUGALL LAU","LAUREN MACDOUGALL"]
[5262,"LK","","Lahti, Kristen (5262) 15%","LK",5262,500,"Lahti, Kristen ","REG",null,null,"NOTEHELFER",5417,"NOTEHELFER","TIM NOTEHELFER","Main",{"$nulls":3},5707,"MAHMOUDI MOHAM","Mohammad Mahmoudi"]
[5263,"HH","","Hakes, Hannah (5263) 15%","HH",5263,500,"Hakes, Hannah ","REG",null,null,"OLEAN",3200,"JANTZ SHELDON","TAMMY OLEAN","Main",{"$nulls":3},5643,"MAKIN S C","STEVE AND CATHY MAKIN"]
[5265,"JV","Exec","Jesus Video Project (5265) 25%{Exec}","JV",5265,200,"Jesus Video Project ","NMF",null,null,"ONG",5530,"ONG, ANDRE","ANDRE ONG","Main",{"$nulls":3},5536,"Mammadov","Amy Mammadov"]
[5266,"MT","","More Than a Carpenter (5265) 0%","MT",5266,200,"More Than a Carpenter ","NMF",null,null,"Parlette",5173,"PARLETTE NANCY","Nancy Parlette","Main",{"$nulls":3},5701,"MANEEVONE","WICHIT & MIRIAM MANEEVONE"]
[5268,"WM","Exec","Web Marketing Project (Pardot) 25%{Exec}","WM",5268,200,"Web Marketing Project ","NMF",null,null,"PAXTON",5651,"PAXTON","MARION PAXTON","Main",{"$nulls":3},5353,"MANNON DAVID","DAVID MANNON"]
[5270,"DD","Exec","Dev Director Ops Exp (5270) 0%{Exec}","DD",5270,200,"Dev Director Ops Exp ","NMF",null,null,"PEARCE",5136,"PEARCE_ANDY","ANDY PEARCE","Main",{"$nulls":3},5453,"MANTA DON","DON MANTA"]
[5271,"DS","","Dunne Special (5271) 10%","DS",5271,500,"Dunne Special ","SPEC",null,null,"PETERSON",5519,"PETERSONN","NANCY PETERSON","Main",{"$nulls":3},5155,"MARQUEZ KAROL","KAROL MARQUEZ"]
[5273,"CF","Exec","CFM Film Distribution/Parnership (5273) 25%{Exec}","CF",5273,200,"CFM Film Distribution/Parnership ","NMF",null,null,"PIERCE",5622,"PIERCE, TRAV HO","TRAVIS PIERCE","Main",{"$nulls":3},5774,"MARSHALL K J","KENT AND JUDY MARSHALL"]
[5275,"TI","Exec","Training Initiatives (5275) 25%{Exec}","TI",5275,200,"Training Initiatives ","NMF",null,null,"POLLARD",5466,"POLLARD_PEGGY","PEGGY POLLARD","Main",{"$nulls":3},5717,"MARVIN","ROB L. MARVIN"]
[5276,"MI","Exec","M28 Initiatives (5276) 25%{Exec}","MI",5276,200,"M28 Initiatives ","NMF",null,null,"PRICE",5553,"PRICE, GEORGE","GEORGE PRICE","Main",{"$nulls":3},"Sunny","MASIH SAJID","Sajid Masih"]
[5278,"HS","Exec","Hindu Student Outreach Initiative (5275) 25%{Exec}","HS",5278,200,"Hindu Student Outreach Initiative ","NMF",null,null,"QUEK",5370,"Quek, Kelly","KELLY QUEK","Main",{"$nulls":3},5636,"Matheny Scott K","Scott & Kathy Matheny"]
[5280,"MA","Exec","Mission America Rec (5280) 0%{Exec}","MA",5280,200,"Mission America Rec ","NMF",null,null,"QUINN",5554,"QUINN","LYNNE QUINN","Main",{"$nulls":3},5146,"Mathew Subhash","Subhash Mathew"]
[5281,"P(","","Personalysis (5281) LM Rest 15%","P(",5281,500,"Personalysis ","NMF",null,null,"RAYBON",5921,"RAYBON, DEBBIE","DEBBIE RAYBON","Main",{"$nulls":3},5314,"MCKAIN REBECCA","REBECCA MCKAIN"]
[5282,"TL","Exec","TRUE Leadership Retreats (5282) 25%{Exec}","TL",5282,200,"TRUE Leadership Retreats ","NMF",null,null,"RIGSTAD",5493,"RIGSTAD, D D","DENNIS RIGSTAD","Main",{"$nulls":3},"","MEADE ELAINE","ELAINE MEADE"]
[5284,"Oa","Exec","Outreach and Technology{Exec}","Oa",5284,300,"Outreach and Technology","NMF",null,null,{"$f":"RIGHT(O223,LEN(O223)-SEARCH(\" \",O223,1))","v":"Roberson"},5730,"ROBERSON WILL","William Roberson","Main",{"$nulls":3},5737,"MENGE SARAH","Sarah Menge"]
[5288,"P2","","Phase 2 Video Proj (5288) 15%","P2",5288,300,{"$f":"LEFT(D224,SEARCH(\"(\",D224,1)-1)","v":"Phase 2 Video Proj "},"NMF",null,null,"ROELANTS",5606,"ROELANTS, Renee","RENEE ROELANTS","Main",{"$nulls":3},3300,"MEULI JENNIFER","JENNIFER MEULI"]
[5290,"CM","Exec","CSF Muslim & Chinese Consultation (5290) 25%{Exec}","CM",5290,300,"CSF Muslim & Chinese Consultation ","NMF",null,null,"RUNYON",5490,"RUNYON, S","STEPHEN RUNYON","Main",{"$nulls":3},3200,"MILLER MARSHA","MARSHA MILLER"]
[5291,"CH","Exec","CSF Hindu Consultation Mtrl Dist. (5291) 25%{Exec}","CH",5291,300,"CSF Hindu Consultation Mtrl Dist. ","NMF",null,null,{"$f":"RIGHT(O226,LEN(O226)-SEARCH(\" \",O226,1))","v":"Samson"},5632,"SAMSON, JENNIFE","Jennifer Samson","Main",{"$nulls":3},5465,"MILLER, GAYLE/R","GAYLE & RON MILLER"]
[5293,"CI","Exec","China Initiative - CT (5293) 25%{Exec}","CI",5293,300,"China Initiative - CT ","NMF",null,null,{"$f":"RIGHT(O227,LEN(O227)-SEARCH(\" \",O227,1))","v":"SAUR"},5768,"SAUR","TED SAUR","Main",{"$nulls":3},3200,"MILLER, MARSHA","MARSHA MILLER"]
[5295,"SI","Exec","Singapore Initiative (5295) 25%{Exec}","SI",5295,300,"Singapore Initiative ","NMF",null,null,"SAWYER",5497,"SAWYER DOUG","DOUG SAWYER","Main",{"$nulls":3},2600,"MILLER, REBEKAH","REBEKAH MILLER"]
[5296,"CR","Exec","CSF Returnee Handbook - New Horizons (5296) 25%{Exec}","CR",5296,300,"CSF Returnee Handbook - New Horizons ","NMF",null,null,"SCHAEFFER",5330,"SCHAEFFER, AVA","AVA SCHAEFFER","Main",{"$nulls":3},5638,"Mills Jessica","Jessica Mills"]
[5298,"IS","","Int'l Student Bible Study (5298) 25%","IS",5298,300,"Int'l Student Bible Study ","NMF",null,null,"SEEVER",5610,"SEEVER, ERIC","ERIC SEEVER","Main",{"$nulls":3},5751,"Mills, Ron & Be","Ron and Beth Mills"]
[5299,"AZ","Exec","Australia/New Zealand Initiatives (5299) 25%{Exec}","AZ",5299,300,"Australia/New Zealand Initiatives ","NMF",null,null,"SEGER",5757,"SEGER, CHRISTIN","CHRISTINE SEGER","Main",{"$nulls":3},5219,"MITCHELL, J/M","JILL OR MIKE MITCHELL"]
[5300,"MS","Exec","Muslim Student Dialogue (5300) 25%{Exec}","MS",5300,300,"Muslim Student Dialogue ","NMF",null,null,"SHAW,D",1100,"COX KYLE","DOUG SHAW,D","Main",{"$nulls":3},5482,"MOSHER, CRAIG","CRAIG MOSHER"]
[5301,"MD","Exec","Major Donor Events (5301) 25%{Exec}","MD",5301,300,"Major Donor Events ","NMF",null,null,"SHAW,K",1100,"COX KYLE","KASSANIA SHAW,K","Main",{"$nulls":3},5728,"MOYNIHAN","Wendy Moynihan"]
[5302,"CJ","","Carlson, Joel (5302) ","CJ",5302,500,"Carlson, Joel ","REG",null,null,"SHELLEY",5375,"SHELLEY, DAVID","DAVID SHELLEY","Main",{"$nulls":3},5480,"Mull, ANDY","ANDY MULL"]
[5303,"SI","Exec","Strat Internet Plan (5303) 0%{Exec}.","SI",5303,200,"Strat Internet Plan ","NMF",null,null,"SHIH",5662,"SHIH PING-YI","PING-YI SHIH","Main",{"$nulls":3},5436,"MURCHISON MARC","MARC and ELISE MURCHISON"]
[5305,"CI","Exec","China Initiatives (5305) 25%{Exec}","CI",5305,200,"China Initiatives ","NMF",null,null,"Shirk",5687,"SHIRKS, CARL LE","Carl Shirk","Main",{"$nulls":3},5311,"NELSON","JEFF NELSON"]
[5306,"HK","Exec","Hong Kong Incorporation (5306) 0%{Exec}","HK",5306,200,"Hong Kong Incorporation ","NMF",null,null,"SIGMAN",5540,"SIGMAN","TIM SIGMAN","Main",{"$nulls":3},5427,"NEWBRANDER, JAC","TIM & JACQUELINE NEWBRANDER"]
[5307,"FJ","","Frost, Jim (5307) 15%","FJ",5307,500,"Frost, Jim ","REG",null,null,"SINCLAIR",5483,"SINCLAIR KERRY","KERRY SINCLAIR","Main",{"$nulls":3},5428,"NEWPHER,","JEFFREY NEWPHER"]
[5308,"ME","Exec","Mdl East Dev GFUN (5308) 25%{Exec}","ME",5308,200,"Mdl East Dev GFUN ","NMF",null,null,"Simpson",5773,"SIMPSON, Jimmy","jim simpson","Main",{"$nulls":3},5183,"NG, BOON-KHAI","NG, BOON-KHAI"]
[5309,"LA","","Lam, Abel Pui-Kiu & Phyllis (5309) 15%","LA",5309,500,"Lam, Abel Pui-Kiu & Phyllis ","REG",null,null,"SMITH",5609,"SMITH","DAN SMITH","Main",{"$nulls":3},5821,"Ng, Dana","Dana Ng"]
[5310,"DS","","Desai Special (5310) 10%","DS",5310,500,"Desai Special ","SPEC",null,null,"SMUCKER",5424,"SMUCKER, MATTHE","MATTHEW SMUCKER","Main",{"$nulls":3},5439,"NG, JOANNA","JOANNA NG"]
[5311,"NJ","","Nelson, Jeff (5311) 15%","NJ",5311,500,"Nelson, Jeff ","REG",null,null,"SODERGREN",5208,"SODERGREN","DAVID SODERGREN","Main",{"$nulls":3},5393,"NORDTVEDT, JOEL","JOEL and MARYBETH NORDTVEDT"]
[5314,"MR","","McKain, Rebecca (5314) 15%","MR",5314,500,"McKain, Rebecca ","REG",null,null,"SONG",5388,"SONG, Si-Chun","SI-CHUN SONG","Main",{"$nulls":3},5417,"NOTEHELFER","TIM & KIM NOTEHELFER"]
[5315,"LS","","Leung, Stephen (5315) 15%","LS",5315,500,"Leung, Stephen ","REG",null,null,"SPADY",5667,"SPADY","JIM SPADY","Main",{"$nulls":3},3200,"OLEAN, T","TAMMY OLEAN"]
[5316,"LS","","Leung Special (5316) 10%","LS",5316,500,"Leung Special ","SPEC",null,null,"SPAULDING",5170,"SPAULDING","RON SPAULDING","Main",{"$nulls":3},5530,"ONG, ANDRE","ANDRE ONG"]
[5317,"AR","","Akhtar, Rasheed (5317) 15%","AR",5317,500,"Akhtar, Rasheed ","REG",null,null,"STARK",5754,"STARK JAMES","JAMES STARK","Main",{"$nulls":3},5111,"ORILEY MARY J","MARY JANE PONTEN"]
[5318,"DB","","Dickinson, Bethany Special (5318) 10%","DB",5318,500,"Dickinson, Bethany Special ","REG",null,null,"STEERS",5345,"STEERS","JOHN STEERS","Main",{"$nulls":3},5173,"PARLETTE NANCY","NANCY PARLETTE"]
[5319,"CM","","Cutler Michael (5319) 15%","CM",5319,500,"Cutler Michael ","REG",null,null,"STEWART",5227,"STEWART,JERILYN","JERILYN STEWART","Main",{"$nulls":3},5651,"PAXTON","MARION PAXTON"]
[5320,"EW","","Evans, Wendy (5320) 15%","EW",5320,500,"Evans, Wendy ","REG",null,null,"STORMS",5425,"STORMS, D","DAVID STORMS","Main",{"$nulls":3},5136,"PEARCE_ANDY","Andrew & Sandy Pearce"]
[5321,"ME","","Manasco Emily (5321) 15%","ME",5321,500,"Manasco Emily ","REG",null,null,"Stynsberg",5659,"STYNSBERG, JaNa","JaNae Stynsberg","Main",{"$nulls":3},5519,"PETERSONN","Nancy Peterson"]
[5324,"FS","Exec","Field Staff Support Director (5324) 25%{Exec}","FS",5324,200,"Field Staff Support Director ","NMF",null,null,"TID",5704,"TIDD Joshua","Joshua Tidd","Main",{"$nulls":3},"","PETTY CASH","PETTY CASH"]
[5326,"KH","","Killion, Howard (5326) 15%","KH",5326,500,"Killion, Howard ","REG",null,null,"Tippery",5652,"TIPPERY, Gabrie","GAB TIPPERY","Main",{"$nulls":3},5622,"PIERCE, TRAV HO","TRAVIS AND HOLLY PIERCE"]
[5328,"DB","","Dickinson, Bethany (5328) 15%","DB",5328,500,"Dickinson, Bethany ","REG",null,null,"THOMAS.C",5162,"THOMAS, CALEN","CALEN THOMAS.C","Main",{"$nulls":3},5466,"POLLARD_PEGGY","Peggy Pollard"]
[5329,"RI","Exec","Reg Inf Min Exp Rec (5329) 25%{Exec}","RI",5329,200,"Reg Inf Min Exp Rec ","NMF",null,null,"THOMAS,E",5221,{"$f":"_xlfn.IFNA(VLOOKUP(M254,T:U,2,),\"\")","v":"THOMAS, E J"},"ERV THOMAS,E","Main",{"$nulls":3},5553,"PRICE, GEORGE","GEORGE & LINDA PRICE"]
[5330,"SA","","Schaeffer, Ava (5330) 15%","SA",5330,500,"Schaeffer, Ava ","REG",null,null,"THOMAS,S",5443,"THOMAS, SANDEEP","THOMAS THOMAS,S","Main",{"$nulls":3},5370,"Quek, Kelly","Kelly Quek"]
[5331,"YD","","Younkin Dan (5331) 15%","YD",5331,500,"Younkin Dan ","REG",null,null,"TOVAR",1100,"COX KYLE","ALEX TOVAR","Main",{"$nulls":3},5554,"QUINN","Lynne or Kevin Quinn"]
[5332,"CA","","Cass, Alisa (5332) 15%","CA",5332,500,"Cass, Alisa ","REG",null,null,"TOWNSEND",5612,"TOWNSEND, JEFFR","JEFF TOWNSEND","Main",{"$nulls":3},5921,"RAYBON, DEBBIE","DEBBIE RAYBON"]
[5333,"PD","","Prod Displays (5333) 0%","PD",5333,200,"Prod Displays ","NMF",null,null,"TRUEX",5356,"TRUEX","AUBREY TRUEX","Main",{"$nulls":3},5493,"RIGSTAD, D D","DENNIS AND DOTTY RIGSTAD"]
[5335,"CJ","","Clements, John (5335) 15%","CJ",5335,500,"Clements, John ","REG",null,null,"UBALDO",5438,"UBALDO","DANIEL UBALDO","Main",{"$nulls":3},5730,"ROBERSON WILL","William Roberson"]
[5336,"CR","","Cossette, Richard & Carol (5336) 15%","CR",5336,500,"Cossette, Richard & Carol ","REG",null,null,"VANOUWERKERK",5217,"van Ouwerkerk","ED VANOUWERKERK","Main",{"$nulls":3},5606,"ROELANTS, Renee","RENEE ROELANTS"]
[5337,"DD","","Daeschner, Dick (5337) 15%","DD",5337,500,"Daeschner, Dick ","REG",null,null,"VEST",5640,"VEST MARY ANN","MARYANN VEST","Main",{"$nulls":3},5490,"RUNYON, S","STEPHEN RUNYON"]
[5338,"WD","","Williams, David (5338) 15% Min Rep","WD",5338,500,"Williams, David ","REG",null,null,"Washington",5916,"WASHINGTON, DEN","Dennis Washington","Main",{"$nulls":3},5632,"SAMSON, JENNIFE","Jennifer Samson"]
[5339,"CS","","Cutler Special (5339) 10%","CS",5339,500,"Cutler Special ","SPEC",null,null,"Watson",5772,"WATSON,Luke Mau","luke watson","Main",{"$nulls":3},5768,"SAUR","TED SAUR"]
[5340,"RW","","Ritchie, Winnie (5340) 8.5%","RW",5340,500,"Ritchie, Winnie ","REG",null,null,"WEBSTER",5795,"WEBSTER","ERNA WEBSTER","Main",{"$nulls":3},5497,"SAWYER DOUG","DOUG SAWYER"]
[5341,"WD","","Williams, D Special (5341) 10% Min Rep","WD",5341,500,"Williams, D Special ","REG",null,null,"WEIDLER",5399,"WEIDLER, JOHN","JOHN WEIDLER","Main",{"$nulls":3},5330,"SCHAEFFER, AVA","AVA SCHAEFFER"]
[5342,"BC","","Boyle, Charles & Tracey (5342) 15%","BC",5342,500,"Boyle, Charles & Tracey ","REG",null,null,"Weir",5918,"WEIR, JOHN","John Weir","Main",{"$nulls":3},5610,"SEEVER, ERIC","ERIC and ANGELA SEEVER"]
[5343,"BC","","Broward County (5343) 25%","BC",5343,300,"Broward County ","REG",null,null,"WESTON",5362,"WESTON, T","TIM WESTON","Main",{"$nulls":3},5757,"SEGER, CHRISTIN","CHRISTINE SEGER"]
[5345,"SJ","","Steers, John & Joyce (5345) 15%","SJ",5345,500,"Steers, John & Joyce ","REG",null,null,"WHITMAN",5368,"WHITMAN","MORT WHITMAN","Main",{"$nulls":3},"","SHARKA, JANE","JANE SHARKA"]
[5346,"HI","","Hodges, Isabel (5346) 15%","HI",5346,500,"Hodges, Isabel ","REG",null,null,{"$f":"RIGHT(O269,LEN(O269)-SEARCH(\" \",O269,1))","v":"willis"},5620,"WILLIS, KRISTY","KRISTY willis","Check",{"$nulls":3},3100,"SHAW KASSANIA","KASSANIA SHAW"]
[5347,"PS","","Paxton Special (5347) 10%","PS",5347,500,"Paxton Special ","SPEC",null,null,"WITJANDRA",5469,"WITJANDRA, F","FREDINAN WITJANDRA","Main",{"$nulls":3},1100,"SHAW, DOUG","DR. DOUG SHAW"]
[5350,"HS","","Hope, Steve & Natasha (5350) 15%","HS",5350,500,"Hope, Steve & Natasha ","REG",null,null,"Woo",5920,"WOO, REBECCA","Rebecca Woo","Main",{"$nulls":3},5375,"SHELLEY, DAVID","DAVID SHELLEY"]
[5351,{"$f":"E272","v":"KL"},{"$f":"IFERROR(MID(D272,SEARCH(\"{\",D272,1)+1,SEARCH(\"}\",D272,1)-SEARCH(\"{\",D272,1)-1),\"\")","v":""},"Kindermann, Lisa () 15%",{"$f":"LEFT(D272,1)&MID(D272,SEARCH(\" \",D272,1)+1,1)","v":"KL"},{"$f":"A272","v":5351},500,"Kindermann, Lisa ","REG",null,null,"WOODS",5197,"WOODS, SCOTT","SCOTT WOODS","Main",{"$nulls":3},5662,"SHIH PING-YI","PING-YI SHIH"]
[5353,"MD","","Mannon, David (5353) 15%","MD",5353,500,"Mannon, David ","REG",null,null,"YABUKI,R",5735,"YABUKI","ROY YABUKI,R","Main",{"$nulls":3},5687,"SHIRKS, CARL LE","CARL & LESLEY SHIRKS"]
[5354,"MC","","Miller, Charles (5354) 15%","MC",5354,500,"Miller, Charles ","REG",null,null,"YABUKI,E",5735,"YABUKI","ELIZABETH YABUKI,E","Main",{"$nulls":3},5540,"SIGMAN","TIMOTHY and JULIE SIGMAN"]
[5355,"CG","","Crowell, Gil (5355) 15%","CG",5355,500,"Crowell, Gil ","REG",null,null,"YESUDASAN",5617,"YESUDASAN, TEDD","TEDDY YESUDASAN","Main",{"$nulls":3},5773,"SIMPSON, Jimmy","JAMES and CHLOE SIMPSON"]
[5356,"TA","","Truex, Aubrey (5356) 15%","TA",5356,500,"Truex, Aubrey ","REG",null,null,"YOUNKIN",5331,"YOUNKIN, DAN","DAN YOUNKIN","Main",{"$nulls":3},5483,"SINCLAIR KERRY","KERRY & JOSIE SINCLAIR"]
[5357,"TS","","Truex Special (5357) 10%","TS",5357,500,"Truex Special ","SPEC",null,null,"Yu",5661,"YU, TERRY","Terry Yu","Main",{"$nulls":3},5609,"SMITH","DAN AND JAN SMITH"]
[5358,"CM","","Cain, Michael & Kathy (5358) 15%","CM",5358,500,"Cain, Michael & Kathy ","REG",null,null,"ZEIGLER",5793,"ZEIGLER","SIMON ZEIGLER","Main",{"$nulls":3},5424,"SMUCKER, MATTHE","MATTHEW SMUCKER"]
[5359,"CS","","Cain Special Fund (5359) 10%","CS",5359,500,"Cain Special Fund ","SPEC",null,null,"ZEIGLER,B",5793,"ZEIGLER","BECKY ZEIGLER,B","Main",{"$nulls":3},5208,"SODERGREN","David Sodergren"]
[5360,"HF","","Humprey Fellows (5360) 0%","HF",5360,200,"Humprey Fellows ","NMF",null,null,"ZULL",5481,"ZULL","PETER ZULL","Main",{"$nulls":3},5388,"SONG, Si-Chun","SI-CHUN SONG"]
[5361,"CH","","Christofer, Hannah (5361) 15%","CH",5361,500,"Christofer, Hannah ","REG",{"$nulls":10},5667,"SPADY","Jim Spady"]
[5362,"WT","","Weston, Tim (5362) 15%","WT",5362,500,"Weston, Tim ","REG",{"$nulls":10},5170,"SPAULDING","Ron & Judy Spaulding"]
[5363,"WS","","Weston Special (5363) 10","WS",5363,500,"Weston Special ","SPEC",{"$nulls":10},3200,"SPENGLER, MARK","Mark Spengler"]
[5364,"AA","","Adrian, Anne (5364) 15%","AA",5364,500,"Adrian, Anne ","REG",{"$nulls":10},5754,"STARK JAMES","JAMES STARK"]
[5365,"AS","","Adrian, Special (5365) 10%","AS",5365,500,"Adrian, Special ","SPEC",{"$nulls":10},5345,"STEERS","JOHN & JOYCE STEERS"]
[5367,"BS","","Bevans, Seth (5367) 15%","BS",5367,500,"Bevans, Seth ","REG",{"$nulls":10},"","STEGEHUIS, TERR","TERRY STEGEHUIS"]
[5368,"WM","","Whitman, Mort (5368) 15%","WM",5368,500,"Whitman, Mort ","REG",{"$nulls":10},5227,"STEWART,JERILYN","JERILYN STEWART"]
[5369,"WS","","Whitman Special (5369) 10%","WS",5369,500,{"$f":"LEFT(D288,SEARCH(\"(\",D288,1)-1)","v":"Whitman Special "},"SPEC",{"$nulls":10},5425,"STORMS, D","DAVID STORMS"]
[5370,"QK","","Quek, Kelly (5370) 15%","QK",5370,500,"Quek, Kelly ","REG",{"$nulls":10},"","STRUBE, THOMAS","THOMAS STRUBE"]
[5371,"QS","","Quek Special (5371) 10%","QS",5371,500,"Quek Special ","SPEC",{"$nulls":10},5659,"STYNSBERG, JaNa","JaNae STYNSBERG"]
[5373,"OS","","Ou-yang Special (5373) 10%","OS",5373,500,"Ou-yang Special ","SPEC",{"$nulls":10},5545,"TANG, SEAN","SEAN TANG"]
[5375,"SD","","Shelly, David (5375) 15%","SD",5375,500,"Shelly, David ","REG",{"$nulls":10},5162,"THOMAS, CALEN","CALEN THOMAS"]
[5376,"DS","","Desai Special (5376) 10%","DS",5376,500,"Desai Special ","SPEC",{"$nulls":10},5221,"THOMAS, E J","ERV AND JANE THOMAS"]
[5377,"SS","Frambes","Seattle Student Spon (5377) 0% {Frambes}","SS",5377,500,"Seattle Student Spon ","CITY",{"$nulls":10},5443,"THOMAS, SANDEEP","THOMAS K THOMAS"]
[5378,"HM","","Hershberger, Mike (5378) 15%","HM",5378,500,"Hershberger, Mike ","REG",{"$nulls":10},5704,"TIDD Joshua","Joshua Tidd"]
[5380,"SJ","","Scott, Jeremy (5380) 15%","SJ",5380,500,"Scott, Jeremy ","REG",{"$nulls":10},5652,"TIPPERY, Gabrie","GABRIEL TIPPERY"]
[5383,"GE","","Godwin, Elizabeth (5383) 15%","GE",5383,500,"Godwin, Elizabeth ","REG",{"$nulls":10},3100,"TOVAR","ALEX TOVAR"]
[5384,"GS","","Godwin Special (5384) 10%","GS",5384,500,"Godwin Special ","SPEC",{"$nulls":10},5612,"TOWNSEND, JEFFR","Jeffrey Townsend"]
[5385,"HS","","Hadley Special (5385) 10%","HS",5385,500,"Hadley Special ","SPEC",{"$nulls":10},5356,"TRUEX","AUBREY TRUEX"]
[5386,"HB","","Hadley, Buell (5386) 15%","HB",5386,500,"Hadley, Buell ","REG",{"$nulls":10},5438,"UBALDO","DANIEL AND PAM UBALDO"]
[5387,"MJ","","Moseley, Jennifer (5387) min rep 15%","MJ",5387,500,"Moseley, Jennifer ","REG",{"$nulls":10},"","UDOKO, NIS DAVI","NSIMA DAVID UDOKO"]
[5388,"SS","","Song, Si-Chun (5388) 15% min","SS",5388,500,"Song, Si-Chun ","REG",{"$nulls":10},5217,"van Ouwerkerk","Ed & Margreet van Ouwerkerk"]
[5391,"AV","","Althouse, Valerie (5391) 15%","AV",5391,500,"Althouse, Valerie ","REG",{"$nulls":10},"","VAN WAGENEN, MA","MARSHA VAN WAGONEN"]
[5392,"HF","","Hutton, Frank (5392) 15%","HF",5392,500,"Hutton, Frank ","REG",{"$nulls":10},"","VANDERPUT, M","MARK OR MARY JANE VANDERPUT"]
[5393,"NJ","","Nordtvedt, Joel & Marybeth (5393) 15%","NJ",5393,500,"Nordtvedt, Joel & Marybeth ","REG",{"$nulls":10},5640,"VEST MARY ANN","Mary Ann Vest"]
[5394,"AJ","","Anthony, Jeff (5394) 15%","AJ",5394,500,"Anthony, Jeff ","REG",{"$nulls":10},5916,"WASHINGTON, DEN","DENNIS WASHINGTON"]
[5395,"KL","","Kragbe, Lisa (5395) 15%","KL",5395,500,"Kragbe, Lisa ","REG",{"$nulls":10},5772,"WATSON,Luke Mau","LUKE and MAUDIE WATSON"]
[5396,"EV","","Easton, Valerie (5396) 15%","EV",5396,500,"Easton, Valerie ","REG",{"$nulls":10},5795,"WEBSTER","ERNA WEBSTER"]
[5398,"LD","","Lim, Danny (5398) 15%","LD",5398,500,"Lim, Danny ","REG",{"$nulls":10},5399,"WEIDLER, JOHN","John Weidler"]
[5399,"WJ","","Weidler, John (5399) 15%","WJ",5399,500,"Weidler, John ","REG",{"$nulls":10},5918,"WEIR, JOHN","JOHN WEIR"]
[5402,"CM","Ingram","Chicago Mobilization - (5402) 10% {Ingram}","CM",5402,500,"Chicago Mobilization - ","CITY",{"$nulls":10},5485,"WELCH, ROB AUD","ROBERT & AUDREY WELCH"]
[5404,"EL","","Emery, Lesley & Wayne (5404) 15%","EL",5404,500,"Emery, Lesley & Wayne ","REG",{"$nulls":10},5362,"WESTON, T","TIM WESTON"]
[5407,"HJ","","Helmen, Jerry (5407) min rep 15%","HJ",5407,500,"Helmen, Jerry ","REG",{"$nulls":10},"","WHITE, CARLA","CARLA WHITE"]
[5408,"DC","bunyard","Dallas, City of (5408) 15% {bunyard}","DC",5408,500,"Dallas, City of ","CITY",{"$nulls":10},5368,"WHITMAN","MORT & JENNY WHITMAN"]
[5409,"DR","bunyard","Dallas Retreat (5409) 0% {bunyard}","DR",5409,500,"Dallas Retreat ","CITY",{"$nulls":10},5836,"WIECK, DIANE-LO","DIANE-LORI WIECK"]
[5410,"DC","bunyard","Dallas City Events (5410) 5%5% {bunyard}","DC",5410,500,"Dallas City Events ","CITY",{"$nulls":10},5338,"WILLIAMS_DAVE","Dave  Q Williams"]
[5411,"LD","","Lockwood, Daniel & Toshiko (5411) 15%","LD",5411,500,"Lockwood, Daniel & Toshiko ","REG",{"$nulls":10},5620,"WILLIS, KRISTY","KRISTY WILLIS"]
[5414,"MS","","McKain Special (5414) 10%","MS",5414,500,"McKain Special ","REG",{"$nulls":10},5469,"WITJANDRA, F","FREDINAN WITJANDRA"]
[5416,"NS","","Notehelfer Special (5416) 10%","NS",5416,500,"Notehelfer Special ","SPEC",{"$nulls":10},5920,"WOO, REBECCA","REBECCA WOO"]
[5417,"NT","","Notehelfer, Tim & Kim (5417) 15%","NT",5417,500,"Notehelfer, Tim & Kim ","REG",{"$nulls":10},5197,"WOODS, SCOTT","SCOTT WOODS"]
[5419,"SC","","South Central Chinese Ministry (5419) 15%","SC",5419,500,"South Central Chinese Ministry ","NMF",{"$nulls":10},5735,"YABUKI","Roy Yabuki"]
[5424,"SM","","Smucker, Matthew (5424) 15%","SM",5424,500,"Smucker, Matthew ","REG",{"$nulls":10},5735,"YABUKI,_ELIZAB","Elizabeth Yabuki"]
[5425,"SD","","Storms, David (5425) min rep 15%","SD",5425,500,"Storms, David ","REG",{"$nulls":10},5617,"YESUDASAN, TEDD","TEDDY YESUDASAN"]
[5426,"KS","","Killion Special (5426) 10%","KS",5426,500,"Killion Special ","SPEC",{"$nulls":10},5331,"YOUNKIN, DAN","DAN YOUNKIN"]
[5427,"NT","","Newbrander, Tim  & Jacqueline (5427) 15%","NT",5427,500,"Newbrander, Tim  & Jacqueline ","REG",{"$nulls":10},5661,"YU, TERRY","TERRY YU"]
[5428,"NJ","","Newpher, Jeffrey (5428) 15%","NJ",5428,500,"Newpher, Jeffrey ","REG",{"$nulls":10},5793,"ZEIGLER","Simon Zeigler"]
[5429,"YA","","York-Herjeczk, Anne (5429) 15%","YA",5429,500,"York-Herjeczk, Anne ","REG",{"$nulls":10},5793,"ZEIGLER, B","BECKY ZEIGLER"]
[5430,"HS","","Hardy Special (5430) 10%","HS",5430,500,"Hardy Special ","SPEC",{"$nulls":10},5481,"ZULL","PETER ZULL"]
[5431,"BD","","Brannen, Dan Special (5431) 10%","BD",5431,500,"Brannen, Dan Special ","SPEC"]
[5434,"BW","","Boyd, William [Roy] (5434) min rep 15%","BW",5434,500,"Boyd, William [Roy] ","REG"]
[5435,"DL","","Dickson, Larry & Pam (5435) min rep 15%","DL",5435,500,"Dickson, Larry & Pam ","REG"]
[5436,"MM","","Murchison, Marc (5436) min rep 15%","MM",5436,500,"Murchison, Marc ","REG"]
[5437,"MS","","Murchison Special (5437) min rep 10%","MS",5437,500,"Murchison Special ","SPEC"]
[5438,"UD","","Ubaldo, Daniel & Pam (5438) 15%","UD",5438,500,"Ubaldo, Daniel & Pam ","REG"]
[5439,"NJ","","Ng, Joanna (5439) 15%","NJ",5439,500,"Ng, Joanna ","REG"]
[5440,{"$f":"E336","v":"CR"},{"$f":"IFERROR(MID(D336,SEARCH(\"{\",D336,1)+1,SEARCH(\"}\",D336,1)-SEARCH(\"{\",D336,1)-1),\"\")","v":""},"Cotton, Ray (5440) 15%",{"$f":"LEFT(D336,1)&MID(D336,SEARCH(\" \",D336,1)+1,1)","v":"CR"},{"$f":"A336","v":5440},500,"Cotton, Ray ","REG"]
[5441,"CS","","Cotton Special (5441) 10%","CS",5441,500,"Cotton Special ","SPEC"]
[5442,"LJ","","Loh, Joel (5442) 15%","LJ",5442,500,"Loh, Joel ","REG"]
[5443,"ST","","Sandeep, Thomas (5443) 15%","ST",5443,500,"Sandeep, Thomas ","REG"]
[5444,"AR","","Abrams, Rob & Kelly (5444) 15%","AR",5444,500,"Abrams, Rob & Kelly ","REG"]
[5445,"AS","","Abrams Special (5445) 10%","AS",5445,500,"Abrams Special ","SPEC"]
[5447,"GD","","Gilchrist, Della (5447) min rep 15%","GD",5447,500,"Gilchrist, Della ","REG"]
[5448,"CE","","Chijindu, Emmanuel (5448) 15%","CE",5448,500,"Chijindu, Emmanuel ","REG"]
[5449,"LP","","Lawecki, Phyllis (5449) 15%","LP",5449,500,"Lawecki, Phyllis ","REG"]
[5450,"LS","","Lawecki Special (5450) 10%","LS",5450,500,"Lawecki Special ","SPEC"]
[5452,"IR","","Ingram, Ronald (5452) 15%","IR",5452,500,"Ingram, Ronald ","REG"]
[5453,"MD","","Manta, Don & Ruth (5453) 15%","MD",5453,500,"Manta, Don & Ruth ","REG"]
[5454,"MS","","Manta Special (5454) 10%","MS",5454,500,"Manta Special ","SPEC"]
[5455,"GT","","Gengler, Tom (5455) 15%","GT",5455,500,"Gengler, Tom ","REG"]
[5456,"ZS","","Zeigler Special (5456) 10%","ZS",5456,500,"Zeigler Special ","SPEC"]
[5457,"CS","","Carlson Special (5457) 10%","CS",5457,500,"Carlson Special ","SPEC"]
[5460,"WN","","Wun, Nathan (5460) 15%","WN",5460,500,{"$f":"LEFT(D352,SEARCH(\"(\",D352,1)-1)","v":"Wun, Nathan "},"REG"]
[5463,"FG","","Freesen, Guy (5463) min rep 15%","FG",5463,500,"Freesen, Guy ","REG"]
[5465,"MR","","Miller, Ron & Gayle (5465) 15%","MR",5465,500,"Miller, Ron & Gayle ","REG"]
[5466,"PP","","Pollard, Peggy (5466) 15%","PP",5466,500,"Pollard, Peggy ","REG"]
[5467,"PS","","Pollard Special (5467) 10%","PS",5467,500,"Pollard Special ","SPEC"]
[5469,"WF","","Witjandra, Fredinan (5469) 15%","WF",5469,500,"Witjandra, Fredinan ","REG"]
[5470,"WS","","Witjandra Special (5470) 10%","WS",5470,500,"Witjandra Special ","SPEC"]
[5471,"DD","","Dorning, Dawn (5471) min rep 15%","DD",5471,500,"Dorning, Dawn ","REG"]
[5472,"DS","","Dorning Special (5472) 10%","DS",5472,500,"Dorning Special ","SPEC"]
[5476,"KJ","","Katekaru, J (5476) MR 15%","KJ",5476,500,"Katekaru, J ","REG"]
[5477,"PK","","Pingel, Kirsten (5477) 15%","PK",5477,500,"Pingel, Kirsten ","REG"]
[5478,"PS","","Pingel Special (5478) 10%","PS",5478,500,"Pingel Special ","SPEC"]
[5480,"MA","","Mull, Andy & Diane (5480) 15%","MA",5480,500,"Mull, Andy & Diane ","REG"]
[5481,"ZP","","Zull, Peter (5481) 15%","ZP",5481,500,"Zull, Peter ","REG"]
[5482,"MC","","Mosher, Craig (5482) 15%","MC",5482,500,"Mosher, Craig ","REG"]
[5483,"SK","","Sinclair, Kerry & Josie (5483) 15%","SK",5483,500,"Sinclair, Kerry & Josie ","REG"]
[5484,"SS","","Sinclair Special (5484) 10%","SS",5484,500,"Sinclair Special ","SPEC"]
[5485,"WA","","Welch, Audrey (5485) 15%","WA",5485,500,"Welch, Audrey ","REG"]
[5486,"KS","","Katekaru Special (5486) min rep 15%","KS",5486,500,"Katekaru Special ","SPEC"]
[5488,"CD","","Clements, Darius (5488) 15%","CD",5488,500,"Clements, Darius ","REG"]
[5489,"BR","","Babcock, Randy & Jan (5489) 15%","BR",5489,500,"Babcock, Randy & Jan ","REG"]
[5490,"RS","","Runyon, Stephen (5490) min rep 15%","RS",5490,500,"Runyon, Stephen ","REG"]
[5491,"BS","","Babcock Special (5491) 10%","BS",5491,500,"Babcock Special ","SPEC"]
[5492,"LM","","Leavister, Margaret (5492) 15%","LM",5492,500,"Leavister, Margaret ","REG"]
[5493,"RD","","Rigstad, Dennis (5493) 15%","RD",5493,500,"Rigstad, Dennis ","REG"]
[5494,"RS","","Rigstad Special (5494) 10%","RS",5494,500,"Rigstad Special ","SPEC"]
[5495,"BS","","Barnett Special (5495) 10%","BS",5495,500,"Barnett Special ","SPEC"]
[5497,"SD","","Sawyer, Doug (5497) 15%","SD",5497,500,"Sawyer, Doug ","REG"]
[5498,"CK","","Carter, Katy (5498) 15% min","CK",5498,500,"Carter, Katy ","REG"]
[5499,"PS","","Portland Student Trips (5499) 15%","PS",5499,500,"Portland Student Trips ","CITY"]
[5500,"KM","","Kruger Memorial/City Ministries (5500) 15%","KM",5500,500,"Kruger Memorial/City Ministries ","CITY"]
[5501,"CG","","Champoux, Ginny  (5501) 15%","CG",5501,500,"Champoux, Ginny  ","REG"]
[5502,"LD","","Low, Dennis (5502) 15%","LD",5502,500,"Low, Dennis ","REG"]
[5503,"CL","","Champoux, Larry & Lucy (5503) 15%","CL",5503,500,"Champoux, Larry & Lucy ","REG"]
[5504,"CL","","Champoux L. Special (5504) 10%","CL",5504,500,"Champoux L. Special ","SPEC"]
[5505,"GJ","","Goll, Joseph & Sheryl (5505) 15%","GJ",5505,500,"Goll, Joseph & Sheryl ","REG"]
[5507,"DM","","Dan McCoy Memorial Fund (5507) 15%","DM",5507,500,"Dan McCoy Memorial Fund ","CITY"]
[5508,"DJ","","Decker, J. Gordon (5508) 10%","DJ",5508,500,"Decker, J. Gordon ","REG"]
[5509,"DS","","Decker Special Trip Account (5509) 10%","DS",5509,500,"Decker Special Trip Account ","SPEC"]
[5510,"DC","","Decker Car Replacement Account (5510) 10%","DC",5510,500,"Decker Car Replacement Account ","SPEC"]
[5512,"GT","","Gold, Timothy (5512) 15%","GT",5512,500,"Gold, Timothy ","REG"]
[5513,"C ","","Champoux  G. Special (5513) 10%","C ",5513,500,"Champoux  G. Special ","SPEC"]
[5514,"BA","","Bricker, Alex (5514) 15%","BA",5514,500,"Bricker, Alex ","REG"]
[5517,"TS","","Trotman Special (5517) 10%","TS",5517,500,"Trotman Special ","SPEC"]
[5519,"PN","","Peterson, Nancy (5519) 15%","PN",5519,500,"Peterson, Nancy ","REG"]
[5520,"PS","","Peterson Special (5520) 10%","PS",5520,500,"Peterson Special ","SPEC"]
[5521,"SP","","Sample, Peter (5521) 15%","SP",5521,500,"Sample, Peter ","REG"]
[5526,"CJ","","Cox, Joanna (5526) 15%","CJ",5526,500,"Cox, Joanna ","REG"]
[5527,{"$f":"E400","v":"FK"},{"$f":"IFERROR(MID(D400,SEARCH(\"{\",D400,1)+1,SEARCH(\"}\",D400,1)-SEARCH(\"{\",D400,1)-1),\"\")","v":""},"Frambes, Kirk & Linda (5527) 15%",{"$f":"LEFT(D400,1)&MID(D400,SEARCH(\" \",D400,1)+1,1)","v":"FK"},{"$f":"A400","v":5527},500,"Frambes, Kirk & Linda ","REG"]
[5529,"CC","Ingram","Chicago Christian Stud Mob (5529) 15% {Ingram}","CC",5529,500,"Chicago Christian Stud Mob ","CITY"]
[5530,"OA","","Ong, Andre (5530) min rep 15%","OA",5530,500,"Ong, Andre ","REG"]
[5531,"SS","","Schaeffer Special (5531) 10%","SS",5531,500,"Schaeffer Special ","SPEC"]
[5533,"ES","","Elisha, Stephen (5533) 15%","ES",5533,500,"Elisha, Stephen ","REG"]
[5534,"BE","","Blackburn, Eleanor (5534) 15%","BE",5534,500,"Blackburn, Eleanor ","REG"]
[5536,"HA","","Hohulin, Amy (5536) 15%","HA",5536,500,"Hohulin, Amy ","REG"]
[5537,"LD","","Larson, David & Beth (5537) 15%","LD",5537,500,"Larson, David & Beth ","REG"]
[5538,"LS","","Larson Special Fund (5538) 10%","LS",5538,500,"Larson Special Fund ","SPEC"]
[5539,"DS","","David, Samuel (5539) 15%","DS",5539,500,"David, Samuel ","REG"]
[5540,"ST","","Sigman, Tim & Julie  (5540) 15%","ST",5540,500,"Sigman, Tim & Julie  ","REG"]
[5541,"SS","","Sigman Special (5541) 10%","SS",5541,500,"Sigman Special ","SPEC"]
[5542,"GC","","Green, Courtney (5542) 15%","GC",5542,500,"Green, Courtney ","REG"]
[5543,"JB","","Jackson Bob & Sandra Special (5543) 10%","JB",5543,500,"Jackson Bob & Sandra Special ","SPEC"]
[5544,"FA","","Ford, Andrea (5544) 15%","FA",5544,500,"Ford, Andrea ","REG"]
[5548,"BP","","Bull, Patricia (5548) 15%","BP",5548,500,{"$f":"LEFT(D415,SEARCH(\"(\",D415,1)-1)","v":"Bull, Patricia "},"REG"]
[5549,"NQ","","Ndibongo, Quintin (5549) min rep 15%","NQ",5549,500,"Ndibongo, Quintin ","REG"]
[5550,"BJ","","Bergman, Jeff & Michiko (5550) 15% min rep","BJ",5550,500,"Bergman, Jeff & Michiko ","REG"]
[5551,"CT","","Cermak, Tony & Dayna (5551) 15%","CT",5551,500,"Cermak, Tony & Dayna ","REG"]
[5552,"HR","","Hansen, Randy (5552) 15%","HR",5552,500,"Hansen, Randy ","REG"]
[5553,"PG","","Price, George & Linda (5553) 15% min","PG",5553,500,"Price, George & Linda ","REG"]
[5554,"QK","","Quinn, Kevin & Lynne (5554) min rep 15%","QK",5554,500,"Quinn, Kevin & Lynne ","REG"]
[5557,"GP","","Gunderson, Paul (5557) 15%","GP",5557,500,"Gunderson, Paul ","REG"]
[5559,"AN","","Allen Norm Special (5559) 15%","AN",5559,500,"Allen Norm Special ","SPEC"]
[5560,"CS","","Carroll, Sam & Joanne (5560)015%","CS",5560,500,"Carroll, Sam & Joanne ","REG"]
[5561,"AJ","","Antoniuk, Jeanette (5561) 15%","AJ",5561,500,"Antoniuk, Jeanette ","REG"]
[5562,"GA","","Grove, Andy (5562) 15%","GA",5562,500,"Grove, Andy ","REG"]
[5563,"FS","","Flammini, Steven & Sandra (5563) 15% min rep","FS",5563,500,"Flammini, Steven & Sandra ","REG"]
[5565,"HS","","Hinke Special (5565) 10%","HS",5565,500,"Hinke Special ","SPEC"]
[5566,"BP","","Burton, Paul (5566) 15%","BP",5566,500,"Burton, Paul ","REG"]
[5567,"LA","","Lapinski, Angela (5567) 15%","LA",5567,500,"Lapinski, Angela ","REG"]
[5568,"MH","","Mualim, Hendry (5568) 15%","MH",5568,500,"Mualim, Hendry ","REG"]
[5572,"JS","","Joseph, Sabu (5572) 15%","JS",5572,500,"Joseph, Sabu ","REG"]
[5573,"JS","","Joseph Special (5573) 10%","JS",5573,500,"Joseph Special ","SPEC"]
[5574,"IS","","Innis, Shirley (5574) 15%","IS",5574,500,"Innis, Shirley ","REG"]
[5575,"HS","","Hawkins, Scott (5575) 15%","HS",5575,500,"Hawkins, Scott ","REG"]
[5576,"CK","","Chau, Kenny (5576) 15%","CK",5576,500,"Chau, Kenny ","REG"]
[5577,null,"","Johnson, Edith (5577) 8.5%","GP",5577,500,"Johnson, Edith ","REG"]
[5578,{"$f":"E438","v":"MJ"},"","Mohamed, Jaber (5578) 15%",{"$f":"LEFT(D438,1)&MID(D438,SEARCH(\" \",D438,1)+1,1)","v":"MJ"},5578,500,"Mohamed, Jaber ","REG"]
[5579,"PS","","Pierce Special (5579) 10%","PS",5579,500,"Pierce Special ","SPEC"]
[5580,"FS","","Fatty, Sainey (5580) 15%","FS",5580,500,"Fatty, Sainey ","REG"]
[5581,"BJ","","Berger, John & Linda (5581) 15%","BJ",5581,500,"Berger, John & Linda ","REG"]
[5582,"BS","","Berger Special (5582) 10%","BS",5582,500,"Berger Special ","SPEC"]
[5584,"BJ","","Billings, Judy (5584) 15%","BJ",5584,500,"Billings, Judy ","REG"]
[5585,"GJ","","Gordon, Jocelyn (5585) 8.5%","GJ",5585,500,"Gordon, Jocelyn ","REG"]
[5586,"HS","","Hawkins Special (5586) 10%","HS",5586,500,"Hawkins Special ","SPEC"]
[5587,"CH","","Combs, Hunter (5587) 15%","CH",5587,500,"Combs, Hunter ","REG"]
[5588,"PG","","Purcell, Graham (5588) 15%","PG",5588,500,"Purcell, Graham ","REG"]
[5590,"WJ","","Wesselink, Jesse (5590) 15%","WJ",5590,500,"Wesselink, Jesse ","REG"]
[5591,"CA","","Ciganic, Adrian (5591) 15% min rep","CA",5591,500,"Ciganic, Adrian ","REG"]
[5593,"HS","","Hargreaves, Sheila (5593) 15%","HS",5593,500,"Hargreaves, Sheila ","REG"]
[5594,"HD","","Halligan, Dale & Liz (5594) 15%","HD",5594,500,"Halligan, Dale & Liz "]
[5595,"HS","","Halligan Special (5595) 10%","HS",5595,500,"Halligan Special ","SPEC"]
[5596,"ED","","Egan, Debbie & Bob (5596) 15%","ED",5596,500,"Egan, Debbie & Bob ","REG"]
[5597,"BR","","Bevans, Rod & Joyce (5597) 15% min rep","BR",5597,500,"Bevans, Rod & Joyce ","REG"]
[5600,"HR","","Huston, Richard (5600) 15% Min","HR",5600,500,"Huston, Richard ","REG"]
[5602,"LR","","Lawton, Robert (5602) 15% Min","LR",5602,500,"Lawton, Robert ","REG"]
[5606,"RR","","Roelants, Renee (5606) 15% min rep","RR",5606,500,"Roelants, Renee ","REG"]
[5607,"CN","","Colaco, Noel (5607) min rep 15%","CN",5607,500,"Colaco, Noel ","REG"]
[5608,"HV","","Hopkins, Virginia (5608) 15%","HV",5608,500,"Hopkins, Virginia ","REG"]
[5609,"SD","","Smith, Dan (5609) 15%","SD",5609,500,"Smith, Dan ","REG"]
[5610,"SE","","Seever, Eric (5610) 15%","SE",5610,500,"Seever, Eric ","REG"]
[5612,"TJ","","Townsend, Jeffrey (5612) 15%","TJ",5612,500,"Townsend, Jeffrey ","REG"]
[5613,"ks",{"$f":"IFERROR(MID(D463,SEARCH(\"{\",D463,1)+1,SEARCH(\"}\",D463,1)-SEARCH(\"{\",D463,1)-1),\"\")","v":""},"Kendagor, Solomon & Ruby (5613) 15%","JB",5584,500,"Kendagor","REG"]
[5614,{"$f":"E464","v":"KS"},"","Kendagor Special (5614) 10%",{"$f":"LEFT(D464,1)&MID(D464,SEARCH(\" \",D464,1)+1,1)","v":"KS"},{"$f":"A464","v":5614},500,"Kendagor","SPEC"]
[5616,{"$f":"E465","v":"BL"},"","Boyd, Lisa (5616) min rep 15%",{"$f":"LEFT(D465,1)&MID(D465,SEARCH(\" \",D465,1)+1,1)","v":"BL"},{"$f":"A465","v":5616},500,{"$f":"LEFT(D465,SEARCH(\"(\",D465,1)-1)","v":"Boyd, Lisa "},"REG"]
[5617,null,"","Yesudasan, Teddy (5617) 15%","NHC",5617,500,"Yesudasan, Teddy ","REG"]
[5619,{"$f":"E467","v":"BH"},"","Black, Helen (5619) 15%",{"$f":"LEFT(D467,1)&MID(D467,SEARCH(\" \",D467,1)+1,1)","v":"BH"},{"$f":"A467","v":5619},500,"Black, Helen ","REG"]
[5620,"WK","","Willis, Kristy (5620) 15%","WK",5620,500,"Willis, Kristy ","REG"]
[5621,"MV","","Max, Vivienne (5621) 8.5%","MV",{"$f":"A469","v":5621},500,"Max, Vivienne ","REG"]
[5622,"PH","","Pierce, Holly and Travis (5622) 15%","PH",{"$f":"A470","v":5622},500,"Pierce, Holly and Travis ","REG"]
[5623,"AR","","Auvil, Ron () %","AR",5623,500,"Auvil, Ron ","REG"]
[5624,"MM","","Means, Melba (5624) 8.5%","MM",{"$f":"A472","v":5624},500,"Means, Melba ","REG"]
[5625,"BM","","Bogen, Mark (5625) 15%","BM",5625,500,"Bogen, Mark ","REG"]
[5627,"HE","","Huang, Echo (5627) 15%","HE",{"$f":"A474","v":5627},500,"Huang, Echo ","REG"]
[5628,"CJ","","Cote, Jennifer (5628) 15%","CJ",5628,500,"Cote, Jennifer ","REG"]
[5631,"LC","","Lindman, Carroll (5631) 15%","LC",5631,500,"Lindman, Carroll ","REG"]
[5632,"FJ","","Farley, Jennifer (5632) 15%","FJ",5632,500,"Farley, Jennifer ","REG"]
[5634,"FA","","Farmer, Aaron & Lydia (5634) 15%","FA",5634,500,"Farmer, Aaron & Lydia ","REG"]
[5636,"MS","","Matheny, Scott & Kathy (5636) 15%","MS",5636,500,"Matheny, Scott & Kathy ","REG"]
[5638,"MJ","","Mills, Jessica (5638) 15%","MJ",5638,500,"Mills, Jessica ","REG"]
[5640,"VM","","Vest, Mary Ann (5640) 15%","VM",5640,500,"Vest, Mary Ann ","REG"]
[5641,"CF","","Coleman, Fred & Pixie (5641) 15%","CF",5641,500,"Coleman, Fred & Pixie ","REG"]
[5643,"MS","","Makin, Steve & Cathy (5643) 15%","MS",5643,500,"Makin, Steve & Cathy ","REG"]
[5644,"TC","Hutton","Twin Cities Scholarships (5644) 0% {Hutton}","TC",5644,500,"Twin Cities Scholarships ","CITY"]
[5647,"DC","","Douglass, Carol (5647) 15%","DC",5647,500,"Douglass, Carol ","REG"]
[5648,"DS","","Douglass Special (5648) 10%","DS",5648,500,"Douglass Special ","SPEC"]
[5649,"LJ","","Lassiter, Jordan & Rebekah (5649) 15%","LJ",5649,500,"Lassiter, Jordan & Rebekah ","REG"]
[5651,"PM","","Paxton, Marion (5651) 15%","PM",5651,500,"Paxton, Marion ","REG"]
[5652,"TG","","Tippery, Gabriel (5652) 15%","TG",5652,500,"Tippery, Gabriel ","REG"]
[5653,"MS","","Mannon Special (5653) %","MS",5653,500,"Mannon Special ","SPEC"]
[5654,"TS","","Thiagarajan, S & R (5654) 8.5%","TS",5654,500,"Thiagarajan, S & R ","REG"]
[5656,"HK","","Haislip, Kevin (5656) 15%","HK",5656,500,"Haislip, Kevin ","REG"]
[5657,"TS","","Thiagarajan Special (5657) 10%","TS",5657,500,"Thiagarajan Special ","SPEC"]
[5658,"KJ","","Kolstad, Jan & David (5658) min rep 15%","KJ",5658,500,"Kolstad, Jan & David ","REG"]
[5659,"SJ","","Stynsberg, JaNae (5659) 15%","SJ",5659,500,"Stynsberg, JaNae ","REG"]
[5660,"BH","","Baker, Herb/Gloria (5660) 8.5%","BH",5660,500,"Baker, Herb/Gloria ","REG"]
[5661,"YT","","Yu, Terry (5661) 15%","YT",5661,500,"Yu, Terry ","REG"]
[5662,"SP","","Shih, Ping-yi (5662) 15%","SP",5662,500,"Shih, Ping-yi ","REG"]
[5663,"SS","","Shih Special (5663) 10%","SS",5663,500,"Shih Special ","SPEC"]
[5664,"DS","","Davis Special (5664) 10%","DS",5664,500,"Davis Special ","SPEC"]
[5665,"DH","","Davis, Howard (5665) 15%","DH",5665,500,"Davis, Howard ","REG"]
[5666,"BA","","Bell, Andrew (5666) 15%","BA",5666,500,"Bell, Andrew ","REG"]
[5667,"SJ","","Spady, Jim (5667) 15%","SJ",5667,500,"Spady, Jim ","REG"]
[5668,"SS","","Spady Special (5668) 10%","SS",5668,500,"Spady Special ","SPEC"]
[5669,"RB","","Reid, Buck (5669) min rep 15%","RB",5669,500,"Reid, Buck ","REG"]
[5670,"MH","","McFarland, Howard (5670) 8.5%","MH",{"$f":"A506","v":5670},500,"McFarland, Howard ","REG"]
[5671,"LH","","Lackey, Heather (5671) 15%","LH",5671,500,"Lackey, Heather ","REG"]
[5672,"BK","","Burton, Kristi (5672) min rep 15%","BK",5672,500,"Burton, Kristi ","REG"]
[5673,"BS","","Burton Special (5673) min rep 10%","BS",5673,500,"Burton Special ","SPEC"]
[5675,"LK","","Lockhart, Kyle (5675) 15%","LK",5675,500,"Lockhart, Kyle ","REG"]
[5679,"HJ","","Herman, Jamieson (5679) 15%","HJ",5679,500,"Herman, Jamieson ","REG"]
[5681,"CB","","Cordell, Beth (5681) 15%","CB",5681,500,"Cordell, Beth ","REG"]
[5683,"CS","","Chen Special (5683) min rep 15%","CS",5683,500,"Chen Special ","SPEC"]
[5684,"CJ","","Chen, Jennifer (5684) Min Rep 15%","CJ",5684,500,"Chen, Jennifer ","REG"]
[5686,"DJ","","Desai, John & Aruna (5686) 15%","DJ",5686,500,"Desai, John & Aruna ","REG"]
[5687,"SC","","Shirk, Carl & Lesley (5687) 15%","SC",5687,500,"Shirk, Carl & Lesley ","REG"]
[5688,"HS","","Haddock, Stephanie (5688) 15%","HS",5688,500,"Haddock, Stephanie ","reg"]
[5689,"FC","","Fitzgerald China Trip (5689) min rep 10%","FC",5689,500,"Fitzgerald China Trip ","SPEC"]
[5690,"FR","","Fitzgerald, Robert (5690) min rep 15%","FR",5690,500,"Fitzgerald, Robert ","REG"]
[5691,"FS","","Fitgerald Special(5691) min rep 10%","FS",5691,500,"Fitgerald Special","SPEC"]
[5692,"DH","","Desai House Fund (5692) 0%","DH",5692,500,"Desai House Fund ","SPEC"]
[5693,"JB","","Jaletta, Blen (5693) 15%","JB",5693,50,"Jaletta, Blen ","REG"]
[5694,"GS","","Germann Special (5694) 10%","GS",5694,500,"Germann Special ","SPEC"]
[5695,"GE","","Germann, Ed (5695) 10%","GE",5695,500,"Germann, Ed ","REG"]
[5697,"GZ","","Gustafson, Zofia (5697) 15%","GZ",5697,500,"Gustafson, Zofia ","REG"]
[5699,"MS","","McCoy Special (5699) 10%","MS",5699,500,"McCoy Special ","SPEC"]
[5700,"MS","","Maneevone Special (5700) 10%","MS",5700,500,"Maneevone Special ","SPEC"]
[5701,"MW","","Maneevone, Wichit (5701) 15%","MW",5701,500,"Maneevone, Wichit ","REG"]
[5704,"TJ","","Tidd, Joshua (5704) 15%","TJ",5704,500,"Tidd, Joshua ","REG"]
[5706,"BD","","Brannen, Dan & Carolyn (5706) 10%","BD",5706,500,"Brannen, Dan & Carolyn ","REG"]
[5707,{"$f":"E531","v":"MM"},{"$f":"IFERROR(MID(D531,SEARCH(\"{\",D531,1)+1,SEARCH(\"}\",D531,1)-SEARCH(\"{\",D531,1)-1),\"\")","v":""},"Mahmoudi, Mohammad (5707) 15%",{"$f":"LEFT(D531,1)&MID(D531,SEARCH(\" \",D531,1)+1,1)","v":"MM"},{"$f":"A531","v":5707},500,{"$f":"LEFT(D531,SEARCH(\"(\",D531,1)-1)","v":"Mahmoudi, Mohammad "},"REG"]
[5708,"TO","","Townsend, Opal (5708) 8.5%","TO",5708,500,"Townsend, Opal ","REG"]
[5709,"YN","","Yamazawa, Naomi (5709) 15%","YN",5709,500,"Yamazawa, Naomi ","REG"]
[5710,"CD","","Chen, Denise (5710) 15%","CD",5710,500,"Chen, Denise ","REG"]
[5712,"HR","","Herring, Richard (5712) 15%","HR",5712,500,"Herring, Richard ","REG"]
[5713,"CA","","Carpenter, Amber (5713) 15%","CA",5713,500,"Carpenter, Amber ","REG"]
[5715,"DR","","Durestnefeld, Richard (5715) 15%","DR",5715,500,"Durestnefeld, Richard ","REG"]
[5717,"MR",{"$f":"IFERROR(MID(D538,SEARCH(\"{\",D538,1)+1,SEARCH(\"}\",D538,1)-SEARCH(\"{\",D538,1)-1),\"\")","v":""},"Marvin, Rob (5717) 8.5%","MR",5717,500,"Marvin, Rob ","REG"]
[5718,"DI","","Downs, Ian & Erin (5718) 15%","DI",5718,500,"Downs, Ian & Erin ","REG"]
[5719,"DS","","Downs Special (5719) 10%","DS",5719,500,{"$f":"LEFT(D540,SEARCH(\"(\",D540,1)-1)","v":"Downs Special "},"SPEC"]
[5720,"FP","","Flynn, Patrick & Christy Lynn (5720) 15%","FP",5720,500,"Flynn, Patrick & Christy Lynn ","REG"]
[5721,{"$f":"E542","v":"FS"},"","Flynn Special (5721) 10%",{"$f":"LEFT(D542,1)&MID(D542,SEARCH(\" \",D542,1)+1,1)","v":"FS"},5721,500,"Flynn Special ","SPEC"]
[5722,"ST","","Shelling, Ted (5722) 8.5%","ST",5722,500,"Shelling, Ted ","REG"]
[5724,"SS","","Spain, Sarah (5724) 15%","SS",5724,500,"Spain, Sarah ","REG"]
[5726,"LL","","Langford, Lezlie (5726) 15%","LL",5726,500,"Langford, Lezlie ","REG"]
[5728,"MW","","Moynihan, Wendy (5728) 15%","MW",5728,500,"Moynihan, Wendy ","REG"]
[5730,"RW","","Roberson, William (5730) 15%","RW",5730,500,"Roberson, William ","REG"]
[5731,"BS","","Bullington Special (5731) 10%","BS",5731,500,"Bullington Special ","SPEC"]
[5733,"ES","","Elisha Special (5733) 10%","ES",5733,500,"Elisha Special ","SPEC"]
[5734,"YS","","Yabuki Special (5734) 10%","YS",5734,500,"Yabuki Special ","SPEC"]
[5735,"YR","","Yabuki, Roy & Lisa (5735) 15%","YR",5735,500,"Yabuki, Roy & Lisa ","REG"]
[5736,"LL","","Lin, Luisa & David (5736) 15%","LL",5736,500,"Lin, Luisa & David ","REG"]
[5737,"MS","","Menge, Sarah (5737) 15%","MS",5737,500,"Menge, Sarah ","REG"]
[5738,"CJ","","Camomile, James & Lisa (5738) 15%","CJ",5738,500,"Camomile, James & Lisa ","REG"]
[5740,"LH","","Lam, Hon (5740) 15%","LH",5740,500,"Lam, Hon ","REG"]
[5743,"DL","","Dodd, Lisa & Chuck (5743) 15%","DL",5743,500,"Dodd, Lisa & Chuck ","REG"]
[5744,"FJ","","Fife, Joan & Eric (5744) 8.5%","FJ",{"$f":"A557","v":5744},500,"Fife, Joan & Eric ","REG"]
[5747,"LT","","Lasher, Trace (5747) 15%","LT",5747,500,"Lasher, Trace ","REG"]
[5750,"HS","","Herholz, Shaun & Andreea (5750) 15%","HS",5750,500,"Herholz, Shaun & Andreea ","REG"]
[5751,"MR","","Mills, Ron (5751) 15%","MR",5751,500,"Mills, Ron ","REG"]
[5752,"MS","","Mills Special (5752) 10%","MS",5752,500,"Mills Special ","SPEC"]
[5754,"SJ","","Stark, James [Alex] (5754) min rep 15%","SJ",5754,500,"Stark, James [Alex] ","REG"]
[5755,"HL","","Holbrook, Lon & Courtney (5755) 15%","HL",5755,500,"Holbrook, Lon & Courtney ","REG"]
[{"$f":"F564","v":5757},"SC","","Seger, Christine (5757) 15%","SC",5757,500,"Seger, Christine ","REG"]
[5759,"HJ","","Harms, Joseph (5759) 15%","HJ",5759,500,"Harms, Joseph","REG"]
[5760,"SF","Germann","South Florida Ops (5760) 15% {Germann}","SF",5760,500,"South Florida Ops ","CITY"]
[5761,"SF","Germann","South Florida Events (5761) 5%5% {Germann}","SF",5761,500,"South Florida Events ","CITY"]
[5763,"HS","","Halferty, Sarah (5763) 15%","HS",5763,500,"Halferty, Sarah ","REG"]
[5764,"AN","","Allen, Norm (5764) 15%","AN",5764,500,"Allen, Norm ","REG"]
[5768,"ST","","Saur, Ted & Denise (5768) minn rep 15%","ST",5768,500,"Saur, Ted & Denise ","REG"]
[5770,"KC","Douglas","Kansas City Area Scholarships (5770) 0% {Douglas}","KC",5770,500,"Kansas City Area Scholarships ","CITY"]
[5772,"WL","","Watson, Luke & Maude (5772) 15%","WL",5772,500,"Watson, Luke & Maude ","REG"]
[5773,"SJ","","Simpson, Jim & Chloe (5773) 15%","SJ",5773,500,"Simpson, Jim & Chloe ","REG"]
[5774,"MK","","Marshall, Kent & Judy (5774) 15%","MK",5774,500,"Marshall, Kent & Judy ","REG"]
[5775,"MS","","Marshall Special (5775) 10%","MS",5775,500,"Marshall Special ","SPEC"]
[5776,"BR","","Bunyard, Ronald (5776) 15%","BR",5776,500,"Bunyard, Ronald ","REG"]
[5777,"BJ","","Becker, Judith (5777) 15%","BJ",5777,500,"Becker, Judith ","REG"]
[5779,"BS","","Becker Special (5779) 10%","BS",5779,500,"Becker Special ","SPEC"]
[5781,"ZY","","Zhao, Yun-Juan (5781) min rep 15%","ZY",5781,500,"Zhao, Yun-Juan ","REG"]
[5782,"TA","Crowell","Tuscan AZ (5782) 15% {Crowell}","TA",5782,500,"Tuscan AZ ","CITY"]
[5783,"JD","","Jackson, Derrah & Pam (5783) 10%","JD",5783,500,"Jackson, Derrah & Pam ","REG"]
[5784,"CA","","Caddell, Angela (5784) 15%","CA",5784,500,"Caddell, Angela ","REG"]
[5786,"KS","","Krehbiel Special (5786) 10%","KS",5786,500,"Krehbiel Special ","SPEC"]
[5787,"DC","","DePalatis, Carolyn (5787) 15%","DC",5787,500,"DePalatis, Carolyn ","REG"]
[5788,"DS","","Depalatis Special (5788) 10%","DS",5788,500,"Depalatis Special ","SPEC"]
[5789,"WS","","Webster Special Fund (5789) 10%","WS",5789,500,"Webster Special Fund ","SPEC"]
[5791,"S-","","Swastek - Special (5791) 10%","S-",5791,500,"Swastek - Special ","SPEC"]
[5792,"MB","","Mitchell, Bill (5792) 15%","MB",5792,500,"Mitchell, Bill ","REG"]
[5793,"ZS","","Zeigler, Simon & Becky (5793) 10%","ZS",5793,500,"Zeigler, Simon & Becky ","REG"]
[5794,"KD","","Krehbiel, Dave (5794) min rep 15%","KD",5794,500,"Krehbiel, Dave ","REG"]
[5795,"WE","","Webster, Erna (5795) 15%","WE",5795,500,"Webster, Erna ","REG"]
[5797,"HC","Yabuki","Houston City (5797) 15% {Yabuki}","HC",5797,500,"Houston City ","CITY"]
[5798,"HE","Yabuki","Houston Events (5798) 5%5% {Yabuki}","HE",5798,500,"Houston Events ","CITY"]
[5799,"BS","Hope","Boston Student Activity (5799) 15% {Hope}","BS",5799,500,"Boston Student Activity ","CITY"]
[5800,"AA","Champoux","Ann Arbor Bible  (5800) 5%{Champoux}","AA",5800,500,"Ann Arbor Bible  ","CITY"]
[5801,"AA","Champoux","Ann Arbor (5801) 15% {Champoux}","AA",5801,500,"Ann Arbor ","CITY"]
[5802,"AI","Hansen","Ames, IA (5802) 15% {Hansen}","AI",5802,500,"Ames, IA ","CITY"]
[5803,"SW","Zeigler","Spokane, WA (5803) 15% {Zeigler}","SW",{"$f":"A598","v":5803},500,"Spokane, WA ","CITY"]
[5804,"BF","Manta","Buffalo F/R Events (5804) 5%5% {Manta}","BF",5804,500,"Buffalo F/R Events ","CITY"]
[5805,"BI","Hawes","Bloomington, Indiana (5805) 15% {Hawes}","BI",5805,500,"Bloomington, Indiana ","CITY"]
[5806,"BM",{"$f":"IFERROR(PROPER(MID(D601,SEARCH(\"{\",D601,1)+1,SEARCH(\"}\",D601,1)-SEARCH(\"{\",D601,1)-1)),\"\")","v":"Hope"},"Boston, MA  (5806) 15% {hope}","BM",5806,500,"Boston, MA  ","CITY"]
[5807,"BN","Manta","Buffalo, NY (5807) 15% {manta}","BN",5807,500,"Buffalo, NY ","CITY"]
[5808,"CI","Ingram","Chicago, IL (5808) 15% {ingram}","CI",5808,500,"Chicago, IL ","CITY"]
[5809,"CC","Germann","Cincinati City (5809) 10% {Germann}","CC",5809,500,"Cincinati City ","CITY"]
[5810,"CS","Halverson","Colorado Springs (5810) 15% {halverson}","CS",5810,500,"Colorado Springs ","CITY"]
[5811,"UA","Bunyard","UT Arlington Student Activity (5811) 15% {bunyard}","UA",5811,500,"UT Arlington Student Activity ","CITY"]
[5812,"TE","Decker","Training Events (5812) 15% {decker}","TE",5812,500,"Training Events ","CITY"]
[5813,"WD","Sigman","Washington DC (5813) 15% {sigman}","WD",5813,500,"Washington DC ","CITY"]
[5814,"DM","Compton","DU Ministry (5814) 15% {compton}","DM",5814,500,"DU Ministry ","CITY"]
[5815,"EA","Smith","Eugene Area (5815) 15% {smith}","EA",5815,500,"Eugene Area ","CITY"]
[5816,"NT","Yabuki","North Texas ISM (5816) 15% {yabuki}","NT",5816,500,"North Texas ISM ","CITY"]
[5819,"RC","Larson","Rochester City (5819) 15% {larson}","RC",5819,500,"Rochester City ","CITY"]
[5820,"TC","Hutton","Twin Cities City (5820) 15% {Hutton}","TC",5820,500,"Twin Cities City ","CITY"]
[5821,"N(","Althouse","NYC (5821) 15% {Althouse}","N(",5821,500,"NYC ","CITY"]
[5822,"Uo","Pearce","Univ of CA Irvine (5822) 15% {Pearce}","Uo",5822,500,"Univ of CA Irvine ","CITY"]
[5823,"M(","Zeigler","Monterey (5823) 15% {zeigler}","M(",5823,500,"Monterey ","CITY"]
[5824,"PE","Sinclair","Portland Events (5824) 5%5% {sinclair}","PE",5824,500,"Portland Events ","CITY"]
[5825,"VS","Truex","Virginia Scholarships (5825) 0% {truex}","VS",5825,500,"Virginia Scholarships ","CITY"]
[5826,"PO","Sinclair","Portland, OR- (5826) 15% {sinclair}","PO",5826,500,"Portland, OR- ","CITY"]
[5827,"PN","Desai","Princeton, NJ (5827) 15% {desai}","PN",5827,500,"Princeton, NJ ","CITY"]
[5828,"PC","Crowell","Phoenix City (5828) 15% {crowell}","PC",5828,500,{"$f":"LEFT(D621,SEARCH(\"(\",D621,1)-1)","v":"Phoenix City "},"CITY"]
[5829,"T(","Boyles","Tempe (5829) 15% {boyles}","T(",5829,500,"Tempe ","CITY"]
[5830,{"$f":"E623","v":"SD"},"Maneevone","San Diego Cnty Ops (5830) 15% {maneevone}",{"$f":"LEFT(D623,1)&MID(D623,SEARCH(\" \",D623,1)+1,1)","v":"SD"},5830,500,"San Diego Cnty Ops ","CITY"]
[5831,"SC","Frambe","Seattle City (5831) 15% {Frambe}","SC",5831,500,"Seattle City ","CITY"]
[5832,"SE","Frambe","Seattle Events (5832) 5%5% {Frambe}","SE",5832,500,"Seattle Events ","CITY"]
[5833,"SL","Weston","ST LOUIS (5833) 15% {Weston}","SL",5833,500,"ST LOUIS ","CITY"]
[5835,"SL","Weston","St. Louis Activities (5835) 15% {Weston}","SL",5835,500,"St. Louis Activities ","CITY"]
[5836,"AC","Yabuki","Albuquerque City (5836) 15% {yabuki}","AC",5836,500,"Albuquerque City ","CITY"]
[5837,"KC","Germann","Kalamazoo City (5837) 15% {Germann}","KC",5837,500,"Kalamazoo City ","CITY"]
[5838,"CE","Ingram","Chicago Events (5838) 5%5% {ingram}","CE",{"$f":"A630","v":5838},500,"Chicago Events ","CITY"]
[5839,"A(","Yabuki","AustinStudSponsorshp (5839) 0% {yabuki}","A(",5839,500,"AustinStudSponsorshp ","CITY"]
[5840,"HK","Yabuki","Hays, KS (5840) 15% {yabuki}","HK",5840,500,"Hays, KS ","CITY"]
[5841,"B(",{"$f":"IFERROR(PROPER(MID(D633,SEARCH(\"{\",D633,1)+1,SEARCH(\"}\",D633,1)-SEARCH(\"{\",D633,1)-1)),\"\")","v":"Larson"},"Baltimore (5841) 15% {larson}","B(",5841,500,"Baltimore ","CITY"]
[5842,"BC","Yabuki","Boulder City Account (5842) 15% {yabuki}","BC",5842,500,"Boulder City Account ","CITY"]
[5843,"RC","Fannin","Rapid City Events (5843) 5%5% {fannin}","RC",5843,500,"Rapid City Events ","CITY"]
[5844,"DC","Hawkins","Durham City (5844) 15% {hawkins}","DC",5844,500,"Durham City ","CITY"]
[5845,"RC","Zeigler","Rocklin, CA (5845) FS 15% {zeigler}","RC",5845,500,"Rocklin, CA ","CITY"]
[5846,"BI","Dunne","Boise, ID (5846) 15% {dunne}","BI",5846,500,"Boise, ID ","CITY"]
[5847,"GN","Wesselink","Greensboro, NC (5847) 15% {wesselink}","GN",5847,500,"Greensboro, NC ","CITY"]
[5848,"SB","Notehelfer","Santa Barbara (5848) 15% {notehelfer}","SB",5848,500,"Santa Barbara ","CITY"]
[5849,"KN","Yabuki","Kearney, NE (5849) 15% {yabuki}","KN",5849,500,"Kearney, NE ","CITY"]
[5850,"PF","Crowell","Phoenix Fundraising Evnt (5850) 5%5% {crowell}","PF",5850,500,"Phoenix Fundraising Evnt ","CITY"]
[5851,"TC","Bunyard","TCU Campus Ministyr (5851) 15% {bunyard}","TC",5851,500,"TCU Campus Ministyr ","CITY"]
[5853,"MT","Halverson","Muslim Task (5853) 0% {halverson}","MT",5853,500,"Muslim Task ","CITY"]
[5854,"FC","Babcock","FT Collins (5854) 15% {babcock}","FC",5854,500,"FT Collins ","CITY"]
[5855,"EB","Harper","East Bay Events (5855) 5%5% {harper}","EB",5855,500,"East Bay Events ","CITY"]
[5856,"EB","Harper","East Bay City (5856) 15% {harper}","EB",5856,500,"East Bay City ","CITY"]
[5857,"FC","Babcock","Ft. Collins Events (5857) 5%5% {babcock}","FC",5857,500,"Ft. Collins Events ","CITY"]
[5858,"RC","Fannin","Rapid City, SD Ops (5858) 15% {fannin}","RC",5858,500,"Rapid City, SD Ops ","CITY"]
[5859,"RS","Fannin","RapidCity Student Conf (5859) 0% {fannin}","RS",5859,500,"RapidCity Student Conf ","CITY"]
[5860,"BS","Manta","Buffalo Student Conf (5860) 0% {manta}","BS",5860,500,"Buffalo Student Conf ","CITY"]
[5861,"RM","Yabuki","Rocky Mtn Events (5861) 5%5% {yabuki}","RM",5861,500,"Rocky Mtn Events ","CITY"]
[5863,"SM","Yabuki","Southeast Michigan (5863) 15% {yabuki}","SM",5863,500,"Southeast Michigan ","CITY"]
[5866,"KC","Douglass","Kansas City (5866) 15% {douglass}","KC",5866,500,"Kansas City ","CITY"]
[5867,"NS","Yabuki","Nebraska State (5867) 15% {yabuki}","NS",5867,500,"Nebraska State ","CITY"]
[5868,"BC","Davis","Bakersfield, CA(5868) 15% {davis}","BC",5868,500,"Bakersfield, CA","CITY"]
[5870,"WR","Zeigler","Western Region Scholarship (5870) 0% {zeigler}","WR",5870,500,"Western Region Scholarship ","CITY"]
[5871,"PC","Yabuki","Pueblo, CO (5871)  15% {yabuki}","PC",5871,500,"Pueblo, CO ","CITY"]
[5872,"DC","Mills","Denver CO (5872) 15% {mills}","DC",5872,500,"Denver CO ","CITY"]
[5873,"BS","Hope","Boston Scholar (5873) 0% {hope}","BS",5873,500,"Boston Scholar ","CITY"]
[5874,"BM","Spady","Bozeman, MT City (5874) 15% {spady}","BM",5874,500,"Bozeman, MT City ","CITY"]
[5875,"TA","Boyles","Tempe Area Scholarships (5875) 0% {boyles}","TA",{"$f":"A662","v":5875},500,"Tempe Area Scholarships ","CITY"]
[5876,"PS","Sinclair","Portland Scholarships (5876) 0% {sinclair}","PS",5876,500,"Portland Scholarships ","CITY"]
[5878,"DS","Bunyard","Dallas Student Spons (5878) 0% {bunyard}","DS",5878,500,"Dallas Student Spons ","CITY"]
[5879,"AC",{"$f":"IFERROR(PROPER(MID(D665,SEARCH(\"{\",D665,1)+1,SEARCH(\"}\",D665,1)-SEARCH(\"{\",D665,1)-1)),\"\")","v":"Marshall"},"A&M Campus, TX (5879) 15% {marshall}","AC",5879,500,"A&M Campus, TX ","CITY"]
[5880,"HC","Prensner","Honolulu City (5880) 15% {prensner}","HC",5880,500,"Honolulu City ","CITY"]
[5881,"SD","Maneevone","San Diego Scholarship (5881) 0% {maneevone}","SD",5881,500,"San Diego Scholarship ","CITY"]
[5882,"SL","Weston","St. Louis Events (5882) 5%5% {weston}","SL",5882,500,"St. Louis Events ","CITY"]
[5883,"IC","Apgar","Irvine CA  Events (5883) 5%5% {apgar}","IC",5883,500,"Irvine CA  Events ","CITY"]
[5884,"IC","Apgar","Irvine CA (5884) 15% {apgar}","IC",5884,500,"Irvine CA ","CITY"]
[5885,"LS","Pearce","LA/Orange Stud Spon (5885) 0% {pearce}","LS",5885,500,"LA/Orange Stud Spon ","CITY"]
[5886,"RC","Zeigler","Riverside County, CA (5886) 15% {zeigler}","RC",5886,500,"Riverside County, CA ","CITY"]
[5887,"AA","Champoux","Ann Arbor Conf/Ret (5887) 0% {champoux}","AA",5887,500,"Ann Arbor Conf/Ret ","CITY"]
[5888,"AA","Champoux","Ann Arbor Events (5888) 5%5% {champoux}","AA",5888,500,"Ann Arbor Events ","CITY"]
[5889,"AS","Marshall","A&M Student Sponsorships (5889) 0% {marshall}","AS",5889,500,"A&M Student Sponsorships ","CITY"]
[5890,"UA","Bunyard","UT Arlington (5890) 15% {bunyard}","UA",5890,500,"UT Arlington ","CITY"]
[5891,"UM","Bunyard","UTD Ministry (5891) 15% {bunyard}","UM",5891,500,"UTD Ministry ","CITY"]
[5892,"RI","Larson","Rhode Island (5892) 15% {larson}","RI",5892,500,"Rhode Island ","CITY"]
[5894,"M&","Webster","Maine & New Hamp (5894) 15% {webster}","M&",5894,500,"Maine & New Hamp ","CITY"]
[5895,"BE","Hope","Boston Events (5895) 5%5% {Hope}","BE",5895,500,"Boston Events ","CITY"]
[5896,"NR","Larson","NE Region Events (5896) 5%5% {larson}","NR",5896,500,"NE Region Events ","CITY"]
[5897,"BS","Manta","Buffalo Special (5897) 10% {manta}","BS",5897,500,"Buffalo Special ","CITY"]
[5898,"DA","Bunyard","Dallas Area Internships (5898) 15% {bunyard}","DA",5898,500,"Dallas Area Internships ","CITY"]
[5899,"MS","","Mitchell Special (5899) 10%","MS",5899,500,"Mitchell Special ","SPEC"]
[5900,"LC","Pearce","LA County Events (5900) 5%5% {pearce}","LC",5900,500,{"$f":"LEFT(D685,SEARCH(\"(\",D685,1)-1)","v":"LA County Events "},"CITY"]
[5901,"LO","Pearce","LA/SoCal Ops (5901) 15% {pearce}","LO",5901,500,"LA/SoCal Ops ","CITY"]
[5902,{"$f":"E687","v":"SJ"},"Zeigler","San Jose, CA (5902) 15% {zeigler}",{"$f":"LEFT(D687,1)&MID(D687,SEARCH(\" \",D687,1)+1,1)","v":"SJ"},5902,500,"San Jose, CA ","CITY"]
[5903,"VS","Yabuki","Vermillion, SD (5903) 15% {yabuki}","VS",5903,500,"Vermillion, SD ","CITY"]
[5904,"CT","","Crowell, Teri (5904) 15%","CT",5904,500,"Crowell, Teri ","REG"]
[5905,"CS","","Crowell Special (5905) 10%","CS",5905,500,"Crowell Special ","SPEC"]
[5906,"ZS","","Zull, Special  (5906) 10%","ZS",5906,500,"Zull, Special  ","SPEC"]
[5907,"LN","","Lee-Paul, Nancy (5907) 15%","LN",5907,500,"Lee-Paul, Nancy ","REG"]
[5908,"CG","","Classen, Gary (5908) 15%","CG",5908,500,"Classen, Gary ","REG"]
[5910,"SD","Maneevone","San Diego Events (5910) 5%5% {maneevone}","SD",5910,500,"San Diego Events ","CITY"]
[5911,"DB","","Dorsch, Bob (5911) 5%","DB",5911,500,"Dorsch, Bob ","REG"]
[5912,"HL","","Harper, Leon (5912) 10%","HL",5912,500,"Harper, Leon ","REG"]
[5913,"HS","","Harper Special (5913) 10%","HS",{"$f":"A697","v":5913},500,"Harper Special ","SPEC"]
[5914,"DJ","","Dykstra, Judy & Doug (5914) 15%","DJ",5914,500,"Dykstra, Judy & Doug ","REG"]
[5916,"WD","","Washington, Dennis (5916) 15%","WD",5916,500,"Washington, Dennis ","REG"]
[5917,"CS","","Chan, Samuel (5917) min rep 15%","CS",5917,500,"Chan, Samuel ","REG"]
[5918,"WJ","","Weir, John (5918) 15%","WJ",5918,500,"Weir, John ","REG"]
[5920,"WR","","Woo, Rebecca (5920) 15%","WR",5920,500,"Woo, Rebecca ","REG"]
[5921,"RD","","Raybon, D. (5921) 15%","RD",5921,500,"Raybon, D. ","REG"]
[5922,"KR","","Kopp, Rob (5922) 15%","KR",5922,500,"Kopp, Rob ","REG"]
[5923,"RM",{"$f":"IFERROR(PROPER(MID(D705,SEARCH(\"{\",D705,1)+1,SEARCH(\"}\",D705,1)-SEARCH(\"{\",D705,1)-1)),\"\")","v":""},"Redding, Millie (5923) 8.5%","RM",5923,500,"Redding, Millie ","REG"]
[5925,"BD","","Bastian, D&P (5925) 15%","BD",5925,500,"Bastian, D&P ","REG"]
[5927,"JG","","Johnson, Gerg & Liz (5927) 15%","JG",5927,500,"Johnson, Gerg & Liz ","REG"]
[5949,"EG","","Eilers, Gary & Alice (5949) min rep 15%","EG",5949,500,"Eilers, Gary & Alice ","REG"]
[5956,"LE","","Lee, Eva (5956) 15%","LE",5956,500,"Lee, Eva ","REG"]
[5963,"FI","Shaw","Friends International UK (5963) 5% {shaw}","FI",5963,500,"Friends International UK ","CITY"]
[7900,{"$f":"E711","v":"IH"},{"$f":"IFERROR(PROPER(MID(D711,SEARCH(\"{\",D711,1)+1,SEARCH(\"}\",D711,1)-SEARCH(\"{\",D711,1)-1)),\"\")","v":""},"ISI Home Office Building (7900) 25%",{"$f":"LEFT(D711,1)&MID(D711,SEARCH(\" \",D711,1)+1,1)","v":"IH"},{"$f":"A711","v":7900},300,{"$f":"LEFT(D711,SEARCH(\"(\",D711,1)-1)","v":"ISI Home Office Building "},"NMF"]

{"sheet":"Summary","index":1,"n_rows":46,"n_cols":38,"rows_kept":46,"merged":[[1,2,3,5],[3,8,5,12],[4,7,5,7],[5,1,5,4],[6,1,6,4],[6,8,7,12],[7,3,7,4],[8,8,9,12],[9,3,9,4],[10,3,10,5],[10,8,11,12],[12,3,12,4],[15,7,15,12],[17,2,18,2],[17,3,18,5],[19,2,20,2],[19,3,20,5],[19,10,19,11],[21,2,22,2],[21,3,22,5],[21,10,21,11],[22,8,31,9],[23,2,24,2],[23,3,24,5],[24,10,24,11],[24,19,24,20],[25,2,26,2],[25,3,26,5],[25,19,25,20],[27,2,28,2],[27,3,28,5],[27,10,27,11],[28,10,29,11],[29,2,30,2],[29,3,30,5],[30,10,30,11],[31,2,32,2],[31,3,32,5],[32,10,32,11],[33,2,34,2],[33,3,34,5],[33,10,36,11],[35,2,36,2],[35,3,36,5],[37,0,37,1],[37,3,37,5],[38,2,38,7],[39,3,40,5],[39,7,40,7],[41,3,42,5],[43,3,44,5]]}
[null,null,"Expense Reimbursement Summary Form for International Students Inc.",{"$nulls":8},"Number of Receipts to be sent",{"$f":"IF(O12<4,0,SUM(Transportation!L40+Donor!L46+'Office Expense'!L42+'Out-of-town Travel'!L43+'Professional Growth'!L42+'Ministry Ops'!L42+'2nd page'!L43+Capital!N43))","v":0},null,1,1,1]
[null,null,{"$f":"IF(F7>F8,\"Unfortunately your form is out of date. Please click on the link below and download a new form.\",IF(AND(M1>0,M2=0),\"THIS REIMBURSEMENT WILL NOT BE PROCESSED UNTIL REQUIRED RECEIPT(S) IS RECEIVED FROM THIS REQUEST\",\"\"))","v":""},{"$nulls":8},"Number of receipts received",{"$f":"SUM(Transportation!N38+Donor!N44+'Office Expense'!N41+'Out-of-town Travel'!N42+'Professional Growth'!N41+'Ministry Ops'!N40+Capital!P42+'2nd page'!N42)","v":0}]
[{"$f":"\"Form last updated: \"&TEXT(L45,\"mm/dd/yy\")","v":"Form last updated: 05/31/18"},{"$nulls":6},"Signatures"]
[{"$nulls":7},"Requestor",{"$f":"IF(B9=0,\"\",B9)","v":" "}]
[null,null,"http://financeisi.weebly.com/downloads.html"]
["fiscal year start date",{"$f":"R32","v":"This Month's deadline is Friday, 06/29/2018 5 p.m. MST/MDT"},{"$nulls":3},{"$f":"TODAY()","v":"2018-06-29"},{"$nulls":7},{"$f":"IF(F7>41670,\"Your form is out of date. Please visit http://financeisi.weebly.com/reimbursements.html and download a new form\",\"\")","v":"Your form is out of date. Please visit http://financeisi.weebly.com/reimbursements.html and download a new form"}]
["2017-10-01",{"$f":"IF(L45>L46,\"Review before uploading on Weebly\",IF(Q30=\"past\",\"You have missed the deadline\",IF(OR(AND(D13=Q37,T25>T26),submit_date>Q37),\"You have missed the deadline\",\"Warning!! This form expires on \"&TEXT(F8,\"mm/dd/yy\"))))","v":"Warning!! This form expires on 07/31/18"},{"$nulls":3},{"$f":"IF(OR(I11>0,D40>0),submit_date,F6)","v":43280},null,{"$f":"IF(E9>5800,\"City Director/Supervisor\",\"RFD/Supervisor\")","v":"RFD/Supervisor"}]
[null,{"$f":"IF(pcode=\" \",\"\",VLOOKUP(pcode,projects_ref,3,))","v":""},null,{"$f":"IF(ProjectCode=\"\",\"\",VLOOKUP(ProjectCode,projects_ref,3,))","v":""},null,"2018-07-31",{"$f":"IF(AND(E9>5799,E9<5901),\"CD\",\"\")","v":""},{"$f":"IF(VLOOKUP(E9,Supervisor,3,)=\" \",\" \",VLOOKUP(E9,Supervisor,3,)&\" Approves\")","v":" Approves"}]
["Name (first and last)"," ","Project/Department",{"$f":"IF(ProjectCode=0,\"\",IF(OR(F9=\"e\",F9=\"escrow\"),501,VLOOKUP(ProjectCode,projects_ref,2,)))","v":""},{"$nulls":3},"Executive Office HO"]
[" ",{"$f":"VLOOKUP(A10,'Vendor IDS'!L2:M280,2,)","v":" "},null,"Required Field (example 5111)"]
[null,null,"Month/Year/Description",{"$nulls":4},"Finance"]
["Date received",{"$nulls":13},{"$f":"COUNTA(B9)+COUNTA(ProjectCode)+COUNTA(Description)+COUNTA(submit_date)","v":1}]
[null,null,"Date Submitted"]
[{"$nulls":3},"(MM/DD/YY)"]
["Spending Category",null,null,"Amount",{"$nulls":3},"For Finance Use Only"]
[{"$nulls":7},"For Accounting use only"]
[{"$nulls":7},"Account"]
["Transportation",null,{"$f":"Transportation!Q13&Transportation!Q14&Transportation!Q15&Transportation!Q16&Transportation!Q17&Transportation!Q18&Transportation!Q19&Transportation!Q20&Transportation!P21&Transportation!P22&Transportation!P23&Transportation!P24&Transportation!P25&Transportation!P26&Transportation!P27&Transportation!P28&Transportation!P30&Transportation!P29&Transportation!P31&Transportation!P32&Transportation!P33&Transportation!P34&Transportation!P35&Transportation!P36&Transportation!P37&'Mileage log'!M177","v":""},{"$f":"IF(E9=0,\"Please\",IF(E9>5999,\"Please\",Transportation!L42))","v":"Please"},{"$nulls":3},50101]
["[Examples: Mileage (from attached log), tolls, parking permits, etc.]",{"$nulls":6},{"$f":"Transportation!Y38+'Mileage log'!T179","v":0},null,null,"Invoice Number"]
["Donor Care",null,{"$f":"Donor!Q16&Donor!Q17&Donor!Q18&Donor!Q19&Donor!Q20&Donor!Q21&Donor!Q22&Donor!Q23&Donor!Q24&Donor!Q25&Donor!Q26&Donor!Q27&Donor!Q28&Donor!Q29&Donor!Q30&Donor!Q31&Donor!Q32&Donor!Q33&Donor!Q34&Donor!Q35&Donor!Q36&Donor!Q37&Donor!Q38&Donor!Q39&Donor!Q40&Donor!Q41&Donor!Q42&Donor!Q43&'Meals-Donor'!L44","v":"                                 "},{"$f":"IF(E9=0,\"Enter\",IF(E9>5999,\"Enter\",Donor!L48))","v":"Enter"},{"$nulls":3},50103,null,null,{"$f":"IF(B9=\" \",\"\",IF(Date_RCVD=\"\",UPPER(LEFT(B9,3)&RIGHT(B9,3)&submit_date&\"-\"&RIGHT(ProjectCode,2)),UPPER(LEFT(B9,3)&RIGHT(B9,2)&B12&\"-\"&RIGHT(ProjectCode,2))))","v":""},{"$nulls":11},"Date","invoice","document amount"," Doc desc","vendor_id","due date","FUND","GL","dept","debit ","credit","Session Description","Total","session ID",null,"Address"]
["(Examples: Prayer letters, newsletters, meals, entertaining, etc)",{"$nulls":6},{"$f":"Donor!Y44+'Meals-Donor'!U44","v":0},null,null,"Batch Number",null,{"$f":"IF(M22>0,\"Void\",\"\")","v":""},{"$nulls":9},{"$f":"IF(Date_Processed=\"\",\"\",Date_Processed)","v":""},{"$f":"IF(Invoice_number=\"\",\"\",Invoice_number)","v":""},{"$f":"IF(Total_Reimb=0,\"\",Total_Reimb)","v":""},{"$f":"IF(Description=\"\",\"\",LEFT(TEXT(Description,\"dd mmm yyy\"),60))","v":""},{"$f":"IF(pcode=\" \",IF(ProjectCode=\"\",\"\",VLOOKUP(ProjectCode,Vendor_id,2,)),IF(pcode=\"\",\"\",VLOOKUP(pcode,Vendor_id,2,)))","v":""},{"$f":"W21","v":""},{"$f":"IF(FundCode=\"\",\"\",FundCode)","v":""},{"$f":"transcode","v":50101},{"$f":"ProjectCode","v":0},{"$f":"IF(transportation_amt>0,transportation_amt,0)","v":"Please"},{"$f":"IF(Summary!W37<0,Summary!W37,0)","v":0},"Monthly Reimbursements",{"$f":"Summary!$D$44","v":0},{"$f":"BatchNumber","v":0},null,{"$f":"IF(pcode=\" \",VLOOKUP(ProjectCode,vendor_address,4,),VLOOKUP(pcode,vendor_address,4,))","v":{"$error":"#N/A"}}]
["Office Expense",null,{"$f":"'Office Expense'!Q16&'Office Expense'!Q17&'Office Expense'!Q18&'Office Expense'!Q19&'Office Expense'!Q20&'Office Expense'!Q21&'Office Expense'!Q22&'Office Expense'!Q23&'Office Expense'!Q24&'Office Expense'!Q25&'Office Expense'!Q26&'Office Expense'!Q27&'Office Expense'!Q28&'Office Expense'!Q29&'Office Expense'!Q30&'Office Expense'!Q31&'Office Expense'!Q32&'Office Expense'!Q33&'Office Expense'!Q34&'Office Expense'!Q35&'Office Expense'!Q36&'Office Expense'!Q37&'Office Expense'!Q38&'Office Expense'!Q39&'Office Expense'!Q40","v":""},{"$f":"IF(E9=0,\"Fund\",IF(E9>5999,\"Fund\",'Office Expense'!L44))","v":"Fund"},{"$nulls":3},50105,{"$nulls":14},"",{"$f":"Invoice_number","v":""},{"$f":"Total_Reimb","v":0},"","",{"$f":"W22","v":""},{"$f":"FundCode","v":""},{"$f":"donorcode","v":50103},0,{"$f":"IF(Donor_amt>0,Donor_amt,0)","v":"Enter"},{"$f":"IF(Summary!W38<0,Summary!W38,0)","v":0},"Monthly Reimbursements",{"$f":"Summary!$D$44","v":0},0,null,{"$error":"#N/A"}]
["(Examples: Rent, telephone, office supplies, postage, copies)",{"$nulls":6},{"$f":"'Office Expense'!Y41","v":0},{"$f":"IF(M1>0,\"Don't Forget to Attach Your Receipts\",\"\")","v":""},{"$nulls":3},{"$f":"IF(LEFT(M24,3)=\"apm\",\"Credit Memo\",IF(LEFT(M24,3)=\"API\",\"Reissue\",\"\"))","v":""},{"$nulls":3},{"$f":"IF(H42>0,1,0)","v":0},{"$nulls":5},"","",0,"","","","",{"$f":"officecode","v":50105},0,{"$f":"IF(Office_amt>0,Office_amt,0)","v":"Fund"},{"$f":"IF(Summary!W39<0,Summary!W39,0)","v":0},"Monthly Reimbursements",{"$f":"Summary!$D$44","v":0},0,null,{"$error":"#N/A"}]
["Out-of-town Travel",null,{"$f":"'Out-of-town Travel'!Q17&'Out-of-town Travel'!Q18&'Out-of-town Travel'!Q19&'Out-of-town Travel'!Q20&'Out-of-town Travel'!Q21&'Out-of-town Travel'!Q22&'Out-of-town Travel'!Q23&'Out-of-town Travel'!Q24&'Out-of-town Travel'!Q25&'Out-of-town Travel'!Q26&'Out-of-town Travel'!Q28&'Out-of-town Travel'!Q27&'Out-of-town Travel'!Q29&'Out-of-town Travel'!Q30&'Out-of-town Travel'!Q31&'Out-of-town Travel'!Q32&'Out-of-town Travel'!Q33&'Out-of-town Travel'!Q34&'Out-of-town Travel'!Q35&'Out-of-town Travel'!Q36&'Out-of-town Travel'!Q37&'Out-of-town Travel'!Q38&'Out-of-town Travel'!Q39&'Out-of-town Travel'!Q40&'Out-of-town Travel'!Q41","v":""},{"$f":"IF(E9=0,\"Number in\",IF(E9>5999,\"Number in\",'Out-of-town Travel'!L45))","v":"Number in"},{"$nulls":3},50107,null,null,"Date",{"$nulls":5},{"$f":"TODAY()-Q26","v":{"v":43280,"d":"43,280.00"}},{"$nulls":5},"","",0,"","","","",{"$f":"travelcode","v":50107},0,{"$f":"IF(Travel_amt>0,Travel_amt,0)","v":"Number in"},{"$f":"IF(Summary!W40<0,Summary!W40,0)","v":0},"Monthly Reimbursements",{"$f":"Summary!$D$44","v":0},0,null,{"$error":"#N/A"}]
["(Examples: Airfare, rental car, hotels, food, misc. travel expense)",{"$nulls":6},{"$f":"'Out-of-town Travel'!Y42","v":0},{"$nulls":7},"expense date",{"$f":"IF(submit_date>0,submit_date,Q26)","v":0},null,"now",{"$f":"NOW()","v":43280.61164293982},null,null,"","",0,"","","","",{"$f":"growthcode","v":50109},0,{"$f":"IF(Growth_amt>0,Growth_amt,0)","v":"Dept/Project"},{"$f":"IF(Summary!W41<0,Summary!W41,0)","v":0},"Monthly Reimbursements",{"$f":"Summary!$D$44","v":0},0,null,{"$error":"#N/A"}]
["Professional Growth",null,{"$f":"'Professional Growth'!Q15&'Professional Growth'!Q16&'Professional Growth'!Q17&'Professional Growth'!Q18&'Professional Growth'!Q19&'Professional Growth'!Q20&'Professional Growth'!Q21&'Professional Growth'!Q22&'Professional Growth'!Q23&'Professional Growth'!Q24&'Professional Growth'!Q25&'Professional Growth'!Q26&'Professional Growth'!Q27&'Professional Growth'!Q28&'Professional Growth'!Q29&'Professional Growth'!Q30&'Professional Growth'!Q31&'Professional Growth'!Q32&'Professional Growth'!Q33&'Professional Growth'!Q34&'Professional Growth'!Q35&'Professional Growth'!Q36&'Professional Growth'!Q38&'Professional Growth'!Q39&'Professional Growth'!Q40","v":""},{"$f":"IF(E9=0,\"Dept/Project\",IF(E9>5999,\"Dept/Project\",'Professional Growth'!L44))","v":"Dept/Project"},{"$nulls":3},50109,{"$nulls":7},"Date of Expenses",{"$f":"IF(Transportation!A13>0,Transportation!A13,IF('Mileage log'!A12>0,'Mileage log'!A12,IF(Donor!A16>0,Donor!A16,IF('Office Expense'!A16>0,'Office Expense'!A16,IF('Out-of-town Travel'!A17>0,'Out-of-town Travel'!A17,IF('Professional Growth'!A15>0,'Professional Growth'!A15,IF('Ministry Ops'!A17>0,'Ministry Ops'!A17,IF(Capital!A18>0,Capital!A18,0))))))))","v":"00:00:00"},null,"dead time",{"$f":"Q37+TIME(16,59,59)","v":43280.70832175926},null,null,"","",0,"","","","",{"$f":"ministrycode","v":50111},0,{"$f":"IF(Ministry_amt>0,Ministry_amt,0)","v":"Space Above"},{"$f":"IF(Summary!W42<0,Summary!W42,0)","v":0},"Monthly Reimbursements",{"$f":"Summary!$D$44","v":0},0,null,{"$error":"#N/A"}]
["(Examples: Seminars, books, tapes, conferences, & training)",{"$nulls":6},{"$f":"'Professional Growth'!Y41","v":0},{"$nulls":7},"Todays date",{"$f":"TODAY()","v":"2018-06-29"},null,null,{"$f":"IF(T25>T26,1,2)","v":2},null,null,"","",0,"","","","",{"$f":"secondcode","v":"00000"},0,{"$f":"IF(second_amt>0,second_amt,0)","v":"Enter Description"},{"$f":"IF(Summary!W43<0,Summary!W43,0)","v":0},"Monthly Reimbursements",{"$f":"Summary!$D$44","v":0},0,null,{"$error":"#N/A"}]
["Ministry Operations",null,{"$f":"'Ministry Ops'!Q17&'Ministry Ops'!Q18&'Ministry Ops'!Q19&'Ministry Ops'!Q20&'Ministry Ops'!Q21&'Ministry Ops'!Q22&'Ministry Ops'!Q23&'Ministry Ops'!Q24&'Ministry Ops'!Q25&'Ministry Ops'!Q26&'Ministry Ops'!Q27&'Ministry Ops'!Q28&'Ministry Ops'!Q29&'Ministry Ops'!Q30&'Ministry Ops'!Q32&'Ministry Ops'!Q31&'Ministry Ops'!Q33&'Ministry Ops'!Q34&'Ministry Ops'!Q35&'Ministry Ops'!Q36&'Ministry Ops'!Q37&'Ministry Ops'!Q38&'Ministry Ops'!Q39&'Meals-Students'!L44","v":"                                 "},{"$f":"IF(E9=0,\"Space Above\",IF(E9>5999,\"Space Above\",'Ministry Ops'!L44))","v":"Space Above"},{"$nulls":3},50111,null,null,{"$f":"IF(OR('Office Expense'!W41>0,Donor!W44>0,'Mileage log'!R180>0,Transportation!W38>0,'Meals-Donor'!Q44,'Out-of-town Travel'!W42>0,'Professional Growth'!W41>0,'Ministry Ops'!W40>0,'Meals-Students'!Q44>0,Capital!AH42>0,'2nd page'!W42>0),\"Exception To Policy\",\"\")","v":""},{"$nulls":4},"Today - 30",{"$f":"Q27-30","v":"2018-05-30"},{"$nulls":5},"","",0,"","","","",{"$f":"equipcode","v":50113},0,{"$f":"IF(Equip_amt>0,Equip_amt,0)","v":"Please Enter"},{"$f":"IF(Summary!W44<0,Summary!W44,0)","v":0},"Monthly Reimbursements",{"$f":"Summary!$D$44","v":0},0,null,{"$error":"#N/A"}]
["(Examples: Expenses related to students, literature, outreach)",{"$nulls":6},{"$f":"'Ministry Ops'!Y40+'Meals-Students'!U44","v":0},{"$nulls":7},"today - 60",{"$f":"Q27-60","v":"2018-04-30"},null,"D13>Q37",{"$nulls":3},"","",0,"","","","",50114,0,{"$f":"IF(Capital_amt>0,Capital_amt,0)","v":"Date Submitted"},{"$f":"IF(Summary!W45<0,Summary!W45,0)","v":0},"Monthly Reimbursements",{"$f":"Summary!$D$44","v":0},0,null,{"$error":"#N/A"}]
["Second page of",{"$f":"IF('2nd page'!C1=0,\"\",'2nd page'!C1)","v":"none"},{"$f":"'2nd page'!Q14&'2nd page'!Q15&'2nd page'!Q16&'2nd page'!Q17&'2nd page'!Q18&'2nd page'!Q19&'2nd page'!Q20&'2nd page'!Q21&'2nd page'!Q22&'2nd page'!Q23&'2nd page'!Q24&'2nd page'!Q25&'2nd page'!Q26&'2nd page'!Q27&'2nd page'!Q28&'2nd page'!Q29&'2nd page'!Q30&'2nd page'!Q31&'2nd page'!Q32&'2nd page'!Q33&'2nd page'!Q34&'2nd page'!Q40&'2nd page'!Q41&'2nd page'!Q45&'2nd page'!Q46","v":""},{"$f":"IF(D11=0,\"Enter Description\",'2nd page'!L45)","v":"Enter Description"},{"$nulls":3},{"$f":"VLOOKUP(B30,pagecode,2,)","v":"00000"},{"$nulls":7},"Lookup Date",{"$f":"IF(Q25=0,Q27-1,IF(Q25<Q29,\"PAST\",IF(Q25<Q28,Q25+30,IF(Q25>0,Q25,TODAY()))))","v":43279},{"$nulls":5},"","",0,"","",{"$f":"W30","v":""},"",50114,0,{"$f":"IF(Plan_amt>0,Plan_amt,0)","v":""},{"$f":"IF(Summary!W46<0,Summary!W46,0)","v":0},"Monthly Reimbursements",{"$f":"Summary!$D$44","v":0},0,null,{"$error":"#N/A"}]
[{"$nulls":7},{"$f":"'2nd page'!Y42","v":0},null,null,{"$f":"IF(B9=\" \",\"\",IF(OR(TODAY()>submit_date+32,Date_Processed>submit_date+32),\"NSF\",\"\"))","v":""},{"$nulls":11},"","",0,"","","","",50114,8999,0,{"$f":"AF29","v":"Date Submitted"},"Monthly Reimbursements",{"$f":"Summary!$D$44","v":0},0,null,{"$error":"#N/A"}]
["Capital Equipment < $2,500(Eqmnt Exp)",null,{"$f":"Capital!R18&Capital!R19&Capital!R20&Capital!R21&Capital!R22&Capital!R23&Capital!R24&Capital!R25&Capital!R26&Capital!R27&Capital!R28&Capital!R29&Capital!R30&Capital!R31&Capital!R32&Capital!R33&Capital!R34&Capital!R35&Capital!R36&Capital!R37&Capital!R38&Capital!R40&Capital!R41&Capital!R42","v":""},{"$f":"IF(D13=0,\"Please Enter\",Capital!N44)","v":"Please Enter"},{"$nulls":3},50113,{"$nulls":9},{"$f":"IF(OR(VLOOKUP(ProjectCode,'Vendor IDS'!$F$1:$I$724,4,)=\"city\",VLOOKUP(ProjectCode,'Vendor IDS'!$F$1:$I$724,4,)=\"nmf\",VLOOKUP(ProjectCode,'Vendor IDS'!$F$1:$I$724,4,)=\"spec\"),\"This City/Special Acct's deadline is \"&S36&S35&\" 12 noon MST/MDT\",\"This Month's deadline is \"&Q36&Q35&\" 5 p.m. MST/MDT\")","v":"This Month's deadline is Friday, 06/29/2018 5 p.m. MST/MDT"},{"$nulls":4},"","",0,"","","","",16400,null,{"$f":"AF29","v":"Date Submitted"},{"$f":"IF(Summary!W47<0,Summary!W47,0)","v":0},"Monthly Reimbursements",{"$f":"Summary!$D$44","v":0},0,null,{"$error":"#N/A"}]
["(Examples: Computers, calculators, file cabinets, furniture, etc.)",{"$nulls":6},{"$f":"Capital!AL42","v":0},null,null,"Special Notes:",{"$nulls":6},{"$f":"IF(OR(VLOOKUP(ProjectCode,'[1]Vendor IDS'!$F$1:$I$723,4,)=\"city\",VLOOKUP(ProjectCode,'[1]Vendor IDS'!$F$1:$I$723,4,)=\"nmf\",VLOOKUP(ProjectCode,'[1]Vendor IDS'!$F$1:$I$723,4,)=\"spec\"),\"Your deposit should be available \"&S38&\" pending fund availablility\",\"Your deposit should be available between \"&Q38&\" and \"&Q39&\" pending fund availability\")","v":"Your deposit should be available between Jul 06 and Jul 11 pending fund availability"},{"$nulls":4},"","",0,"","","","",50114,8999,0,{"$f":"AF30","v":""},"Monthly Reimbursements",{"$f":"Summary!$D$44","v":0},0,null,{"$error":"#N/A"}]
["Capital Equipment > $2,500 (Fixed Assets)",null,{"$f":"IF(D34>0,C32,\"\")","v":""},{"$f":"IF(D13=0,\"Date Submitted\",Capital!N45)","v":"Date Submitted"},{"$nulls":3},50114,{"$nulls":10},"Special Reimb",{"$nulls":3},"","",0,"","","","",22170,null,{"$f":"AF30","v":""},{"$f":"IF(Summary!W50<0,Summary!W50,0)","v":0},"Monthly Reimbursements",{"$f":"Summary!$D$44","v":0},0,null,{"$error":"#N/A"}]
["(Examples: Computers, calculators, file cabinets, furniture, etc.)",{"$nulls":6},"then reverse as follows:   asset gl/NoProj          Dr     50114/8999                      Cr",{"$nulls":7},"Date due",{"$f":"IF(Q26=\"past\",\"\",IF(AND(Q25<Q28,Q25<>0),VLOOKUP(Q28,RegDeadline,2,),VLOOKUP(Q30,RegDeadline,2)))","v":"06/29/2018"},null,{"$f":"IF(OR(VLOOKUP(ProjectCode,'[1]Vendor IDS'!$F$1:$I$723,4,)=\"City\",VLOOKUP(ProjectCode,'[1]Vendor IDS'!$F$1:$I$723,4,)=\"nmf\",VLOOKUP(ProjectCode,'[1]Vendor IDS'!$F$1:$I$723,4,)=\"spec\"),VLOOKUP(Q30,City_Deadlines,2),0)","v":0},{"$nulls":3},"","",0,"","","","",16400,null,{"$f":"IF(Capital!AC61=1,Capital!AD61,0)","v":0},{"$f":"IF(Summary!W51<0,Summary!W51,0)","v":0},"Monthly Reimbursements",{"$f":"Summary!$D$44","v":0},0,null,{"$error":"#N/A"}]
["Capital Equipment > ($2,500 (on payment plan)",null,{"$f":"IF(D36>0,C32,\"\")","v":""},{"$f":"IF(D13=0,\"\",Capital!N46)","v":""},{"$nulls":3},50114,{"$nulls":7},"Day Due",{"$f":"IF(Q30=\"past\",\"past due\",VLOOKUP(Q30,RegDeadline,3))","v":"Friday, "},null,{"$f":"IF(Q30=\"past\",\"past due\",VLOOKUP(Q30,City_Deadlines,3))","v":"Wednesday, "},{"$nulls":3},"","",0,"","",{"$f":"W36","v":""},"",22170,null,0,{"$f":"AF35","v":0},"Monthly Reimbursements",{"$f":"Summary!$D$44","v":0},0,null,{"$error":"#N/A"}]
["(Examples: Computers, calculators, file cabinets, furniture, etc.)",{"$nulls":6},"then reverse as follows:           DR 22170/No Proj                        Cr 50114/8999                 ",{"$nulls":7},"warning date",{"$f":"IF(S35>0,VALUE(S35),VALUE(Q35))","v":43280},{"$nulls":3},"weekly"]
["For Accounting use only",null,"If capital equipment has not been recorded in the G/L, then make this entry for items listed on capital sheet > 1000",{"$f":"Capital!AA42","v":0},{"$nulls":3},"Record value of asset:           DR (asset gl)/No Proj                       Cr 22170/No Proj                 ",{"$nulls":7},"Deposit Date",{"$f":"VLOOKUP(Q30,[1]Deadlines!$A$3:$F$18,5)","v":"Jul 06"},null,{"$f":"IF(OR(VLOOKUP(ProjectCode,'[1]Vendor IDS'!$F$1:$I$723,4,)=\"City\",VLOOKUP(ProjectCode,'[1]Vendor IDS'!$F$1:$I$723,4,)=\"nmf\",VLOOKUP(ProjectCode,'[1]Vendor IDS'!$F$1:$I$723,4,)=\"spec\"),VLOOKUP(Q30,[1]Deadlines!G3:L39,5),0)","v":0},null,"monthly"]
[null,null,{"$f":"IF(Total_Reimb=0,B6,W33)","v":"This Month's deadline is Friday, 06/29/2018 5 p.m. MST/MDT"},{"$nulls":13},{"$f":"VLOOKUP(Q30,[1]Deadlines!$A$3:$F$18,6)","v":"Jul 11"}]
[null,null,"Subtotal",{"$f":"IF(AND(SUM(D18:F37)<50,Q24<55,Q23=0),\"DO NOT SUBMIT UNTIL OVER $50\",SUM(D18:F37))","v":0},{"$nulls":3},{"$f":"IF(H42>0,\"Exception Allowed\",\"\")","v":""},"*Requests must be submitted within 60 days of expense "]
[{"$nulls":8},"  being incurred."]
[null,null,"Less Advance",0,{"$nulls":4},"**Deadline to submit form to the Home Office is 5pm MST"]
[null,null,"please enter advance code here",{"$nulls":4},{"$f":"IF(P43>0,\"Current FY = \"&Total_Reimb-P43,\"\")","v":""},"***Send to ","reimbursements@isionline.org ",{"$nulls":5},{"$f":"IF(submit_date=\"\",0,Transportation!Y38+'Mileage log'!T179+Donor!Y44+'Meals-Donor'!U44+'Office Expense'!Y41+'Out-of-town Travel'!Y42+'Professional Growth'!Y41+'Ministry Ops'!Y40+'Meals-Students'!U44+Capital!AL42+'2nd page'!Y42)","v":0}]
[null,null,"Total Reimbursement",{"$f":"IF(D40=\"DO NOT SUBMIT UNTIL OVER $50\",\"\",IF(M37>0,\"Dissallow > 1 yr old\",SUM(D40-D42)))","v":0},{"$nulls":3},{"$f":"IF(P43>0,\"Prior FY = \"&P43,\"\")","v":""},"****ISI Home Office Fax #: (719) 576-5363"]
[{"$nulls":8},"This form was updated on :",null,null,"2018-05-31"]
[{"$f":"IF(expensedate=0,1,2)","v":1},{"$nulls":7},"Reviewed by Finance:",null,null,"2018-05-31"]

{"sheet":"email-approvals","index":2,"n_rows":0,"n_cols":0,"rows_kept":0}

{"sheet":"Deadlines","index":3,"n_rows":39,"n_cols":11,"rows_kept":39,"hidden":true,"merged":[[0,0,0,4],[0,6,0,9]]}
["Regular Monthly Reimbursements",{"$nulls":5},"City & Special Reimbursements"]
["beginning of month",null,"day of week","Deadline",{"$nulls":3},"text deadline",null,"Deadline"]
["2017-12-01",{"$f":"TEXT(D3,\"mm/dd/yyyy\")","v":"12/29/2017"},{"$f":"TEXT(D3,\"dddd\")&\", \"","v":"Friday, "},"2017-12-29",{"$f":"TEXT(D3+7,\"MMM DD\")","v":"Jan 05"},{"$f":"TEXT(D3+12,\"MMM DD\")","v":"Jan 10"},"2017-12-15",{"$f":"TEXT(J3,\"mm/dd/yyyy\")","v":"12/27/2017"},{"$f":"TEXT(J3,\"dddd\")&\", \"","v":"Wednesday, "},"2017-12-27",{"$f":"TEXT(J3+2,\"MMM DD\")","v":"Dec 29"}]
["2018-01-01","02/01/2018","Thursday, ","2018-02-01","Feb 08","Feb 13",{"$f":"J3+2","v":"2017-12-29"},"01/10/2018","Wednesday, ","2018-01-10","Jan 12"]
["2018-02-01","03/01/2018","Thursday, ","2018-03-01","Mar 08","Mar 13","2018-01-12","01/24/2018","Wednesday, ","2018-01-24","Jan 26"]
["2018-03-01","03/30/2018","Friday, ","2018-03-30","Apr 06","Apr 11","2018-01-26","01/31/2018","Wednesday, ","2018-01-31","Feb 02"]
["2018-04-01","05/01/2018","Tuesday, ","2018-05-01","May 08","May 13","2018-02-02","02/14/2018","Wednesday, ","2018-02-14","Feb 16"]
["2018-05-01",{"$f":"TEXT(D8,\"mm/dd/yyyy\")","v":"06/01/2018"},"Friday, ","2018-06-01","Jun 08","Jun 13","2018-02-16","02/28/2018","Wednesday, ","2018-02-28","Mar 02"]
["2018-06-01",{"$f":"TEXT(D9,\"mm/dd/yyyy\")","v":"06/29/2018"},"Friday, ","2018-06-29","Jul 06","Jul 11","2018-03-02","03/14/2018","Wednesday, ","2018-03-14","Mar 16"]
["2018-07-01","08/01/2018","Wednesday, ","2018-08-01","Aug 08","Aug 13","2018-03-16","03/28/2018","Wednesday, ","2018-03-28","Mar 30"]
["2018-08-01","08/31/2018","Friday, ","2018-08-31","Sep 07","Sep 12","2018-03-30","04/11/2018","Wednesday, ","2018-04-11","Apr 13"]
["2018-09-01","10/01/2018","Monday, ","2018-10-01","Oct 08","Oct 13","2018-04-13","04/25/2018","Wednesday, ","2018-04-25","Apr 27"]
["2018-10-01",{"$f":"TEXT(D13,\"mm/dd/yyyy\")","v":"11/01/2018"},{"$f":"TEXT(D13,\"dddd\")&\", \"","v":"Thursday, "},"2018-11-01",{"$f":"TEXT(D13+7,\"MMM DD\")","v":"Nov 08"},{"$f":"TEXT(D13+12,\"MMM DD\")","v":"Nov 13"},"2018-04-27","05/09/2018","Wednesday, ","2018-05-09","May 11"]
["2018-11-01",{"$f":"TEXT(D14,\"mm/dd/yyyy\")","v":"11/30/2018"},"Friday, ","2018-11-30","Dec 07","Dec 12","2018-05-11","05/23/2018","Wednesday, ","2018-05-23","May 25"]
["2018-12-01","12/31/2018","Monday, ","2018-12-31","Jan 07","Jan 12","2018-05-25","05/30/2018","Wednesday, ","2018-05-30","Jun 01"]
["2019-01-01","02/01/2019","Friday, ","2019-02-01","Feb 08","Feb 13","2018-06-01","06/13/2018","Wednesday, ","2018-06-13","Jun 15"]
["2019-02-01","03/01/2019","Friday, ","2019-03-01","Mar 08","Mar 13","2018-06-15","06/27/2018","Wednesday, ","2018-06-27","Jun 29"]
["2019-03-01","04/01/2019",{"$f":"TEXT(D18,\"dddd\")&\", \"","v":"Monday, "},"2019-04-01","Apr 08","Apr 13","2018-06-29","07/11/2018","Wednesday, ","2018-07-11","Jul 13"]
[{"$nulls":6},"2018-07-13","07/25/2018","Wednesday, ","2018-07-25","Jul 27"]
[{"$nulls":6},"2018-07-27","08/08/2018","Wednesday, ","2018-08-08","Aug 10"]
[{"$nulls":6},"2018-08-10","08/22/2018","Wednesday, ","2018-08-22","Aug 24"]
[{"$nulls":6},"2018-08-24","08/29/2018","Wednesday, ","2018-08-29","Aug 31"]
[{"$nulls":6},"2018-08-31","09/12/2018","Wednesday, ","2018-09-12","Sep 14"]
[{"$nulls":6},"2018-09-14","09/26/2018","Wednesday, ","2018-09-26","Sep 28"]
[{"$nulls":6},"2018-09-28","10/10/2018","Wednesday, ","2018-10-10","Oct 12"]
[{"$nulls":6},"2018-10-12","10/24/2018","Wednesday, ","2018-10-24","Oct 26"]
[{"$nulls":6},"2018-10-26","10/31/2018","Wednesday, ","2018-10-31","Nov 02"]
[{"$nulls":6},"2018-11-02","11/14/2018","Wednesday, ","2018-11-14","Nov 16"]
[{"$nulls":6},"2018-11-16","11/21/2018","Wednesday, ","2018-11-21","Nov 23"]
[{"$nulls":6},{"$f":"J29+2","v":"2018-11-23"},"11/28/2018","Wednesday, ","2018-11-28","Nov 30"]
[{"$nulls":6},{"$f":"J30+2","v":"2018-11-30"},{"$f":"TEXT(J31,\"mm/dd/yyyy\")","v":"12/12/2018"},{"$f":"TEXT(J31,\"dddd\")&\", \"","v":"Wednesday, "},"2018-12-12",{"$f":"TEXT(J31+2,\"MMM DD\")","v":"Dec 14"}]
[{"$nulls":6},{"$f":"J31+2","v":"2018-12-14"},"12/26/2018","Wednesday, ","2018-12-26","Dec 28"]
[{"$nulls":6},"2018-12-28","01/09/2019","Wednesday, ","2019-01-09","Jan 11"]
[{"$nulls":6},"2019-01-11","01/23/2019","Wednesday, ","2019-01-23","Jan 25"]
[{"$nulls":6},"2019-01-25","02/13/2019","Wednesday, ","2019-02-13","Feb 15"]
[{"$nulls":6},"2019-02-15","02/27/2019","Wednesday, ","2019-02-27","Mar 01"]
[{"$nulls":6},"2019-03-01","03/13/2019","Wednesday, ","2019-03-13","Mar 15"]
[{"$nulls":6},"2019-03-15","03/27/2019","Wednesday, ","2019-03-27","Mar 29"]
[{"$nulls":6},"2019-03-29","04/10/2019","Wednesday, ","2019-04-10","Apr 12"]

{"sheet":"Transportation","index":4,"n_rows":42,"n_cols":25,"rows_kept":42,"merged":[[3,6,3,8],[3,9,3,11],[4,6,4,8],[4,9,4,11],[5,6,5,8],[5,9,5,11],[6,6,6,8],[6,9,6,11],[7,6,7,8],[7,9,7,11],[8,6,8,8],[8,9,8,11],[9,1,9,3],[9,7,9,10],[9,15,9,19],[9,20,10,20],[9,21,10,21],[9,22,10,22],[9,23,10,23],[9,24,10,24],[10,1,10,3],[10,4,10,6],[10,7,10,10],[10,16,10,19],[11,1,11,3],[11,4,11,6],[11,7,11,10],[12,1,12,3],[12,4,12,6],[12,7,12,10],[12,16,12,19],[13,1,13,3],[13,4,13,6],[13,7,13,10],[13,16,13,19],[14,1,14,3],[14,4,14,6],[14,7,14,10],[14,16,14,19],[15,1,15,3],[15,4,15,6],[15,7,15,10],[15,16,15,19],[16,1,16,3],[16,4,16,6],[16,7,16,10],[16,16,16,19],[17,1,17,3],[17,4,17,6],[17,7,17,10],[17,16,17,19],[18,1,18,3],[18,4,18,6],[18,7,18,10],[18,16,18,19],[19,1,19,3],[19,4,19,6],[19,7,19,10],[19,16,19,19],[20,1,20,3],[20,4,20,6],[20,7,20,10],[20,16,20,19],[21,1,21,3],[21,4,21,6],[21,7,21,10],[21,16,21,19],[22,1,22,3],[22,4,22,6],[22,7,22,10],[22,16,22,19],[23,1,23,3],[23,4,23,6],[23,7,23,10],[23,16,23,19],[24,1,24,3],[24,4,24,6],[24,7,24,10],[24,16,24,19],[25,1,25,3],[25,4,25,6],[25,7,25,10],[25,16,25,19],[26,1,26,3],[26,4,26,6],[26,7,26,10],[26,16,26,19],[27,1,27,3],[27,4,27,6],[27,7,27,10],[27,16,27,19],[28,1,28,3],[28,4,28,6],[28,7,28,10],[28,16,28,19],[29,1,29,3],[29,4,29,6],[29,7,29,10],[29,16,29,19],[30,1,30,3],[30,4,30,6],[30,7,30,10],[30,16,30,19],[31,1,31,3],[31,4,31,6],[31,7,31,10],[31,16,31,19],[32,1,32,3],[32,4,32,6],[32,7,32,10],[32,16,32,19],[33,1,33,3],[33,4,33,6],[33,7,33,10],[33,16,33,19],[34,1,34,3],[34,4,34,6],[34,7,34,10],[34,16,34,19],[35,1,35,3],[35,4,35,6],[35,7,35,10],[35,16,35,19],[36,1,36,3],[36,4,36,6],[36,7,36,10],[36,16,36,19],[38,0,41,7]]}
[null,"Mileage (from attached Mileage Log)",{"$nulls":3},"Parking Permits",{"$nulls":3},"Name",{"$f":"Summary!B9","v":" "}]
[null,"Tolls",{"$nulls":3},"Parking Expenses",{"$nulls":3},"Project",{"$f":"Summary!E9","v":0}]
[]
["*  ORIGINAL Receipts required if $75.00 or greater",{"$nulls":5},"Abbreviations:"]
["List complete information below for all expenses.",{"$nulls":5},"PD=Partnership Development"]
[{"$nulls":6},"ICF=International Christian Fellowship"]
["**Expenses must be submitted with"]
["   in 60 days of being incurrec."]
[]
["Date","Name of person",{"$nulls":5},"Location",{"$nulls":7},"office use only",{"$nulls":4},"amt  +/-","Disallowed","Exception","Disallowed","for audit work"]
["(mm/dd/yy)","and type of item",null,null,"Ministry purpose",null,null,"(Company/Restaurant and City and State)",{"$nulls":3},"Amount",{"$nulls":3},"initials","correction explanation"]
[{"$nulls":12},{"$f":"IF(L12>=75,\"*\",\" \")","v":" "},null,{"$f":"IF(L12>=75,L12,\" \")","v":" "}]
[{"$nulls":12},{"$f":"IF(A13>0,IF(submit_date>0,IF(submit_date-A13>60,\"disallow\",IF(L13>=75,IF(AND(N13=\"\",TODAY()-submit_date>30),\"disallow\",\"*\"),\" \")),IF(TODAY()-A13>60,\"disallow\",IF(L13>=75,IF(AND(N13=\"\",TODAY()-submit_date>30),\"disallow\",\"*\"),\" \"))),IF(L13>=75,IF(AND(N13=\"\",TODAY()-submit_date>30),\"disallow\",\"*\"),\"\"))","v":""},null,{"$f":"IF(AND(L13>=75,M13<>\"disallow\"),1,\" \")","v":" "},{"$nulls":6},{"$f":"IF(AND(M13=\"disallow\",W13=0),L13,0)","v":0},null,{"$f":"IF(W13>0,-U13,0)","v":0},{"$f":"IF(AND(A13<Fiscal_Start_Date,submit_date-A13<90),L13,0)","v":0}]
[{"$nulls":12},"",null,{"$f":"IF(AND(L14>=75,M14<>\"disallow\"),1,\" \")","v":" "},{"$nulls":6},0,null,{"$f":"IF(W14>0,-U14,0)","v":0},0]
[{"$nulls":12},"",null," ",{"$nulls":6},0,null,0,0]
[{"$nulls":12},"",null," ",{"$nulls":6},0,null,0,0]
[{"$nulls":12},"",null," ",{"$nulls":6},0,null,0,0]
[{"$nulls":12},"",null," ",{"$nulls":6},0,null,0,0]
[{"$nulls":12},"",null," ",{"$nulls":6},0,null,0,0]
[{"$nulls":12},"",null," ",{"$nulls":6},0,null,0,0]
[{"$nulls":12},"",null," ",{"$nulls":6},0,null,0,0]
[{"$nulls":12},"",null," ",{"$nulls":6},0,null,0,0]
[{"$nulls":12},"",null," ",{"$nulls":6},0,null,0,0]
[{"$nulls":12},"",null," ",{"$nulls":6},0,null,0,0]
[{"$nulls":12},"",null," ",{"$nulls":6},0,null,0,0]
[{"$nulls":12},"",null," ",{"$nulls":6},0,null,0,0]
[{"$nulls":12},"",null," ",{"$nulls":6},0,null,0,0]
[{"$nulls":12},"",null," ",{"$nulls":6},0,null,0,0]
[{"$nulls":12},"",null," ",{"$nulls":6},0,null,0,0]
[{"$nulls":12},"",null," ",{"$nulls":6},0,null,0,0]
[{"$nulls":12},"",null," ",{"$nulls":6},0,null,0,0]
[{"$nulls":12},"",null," ",{"$nulls":6},0,null,0,0]
[{"$nulls":12},"",null," ",{"$nulls":6},0,null,0,0]
[{"$nulls":12},"",null," ",{"$nulls":6},0,null,0,0]
[{"$nulls":12},"",null," ",{"$nulls":6},0,null,0,0]
[{"$nulls":12},"",null," ",{"$nulls":6},0,null,0,0]
[{"$nulls":12},"",null," ",{"$nulls":6},0,null,0,0]
[{"$nulls":10},"Sub-Total",{"$f":"IF(Summary!O12>3,SUM(L13:L37)-V38,\"Please Fill in\")","v":"Please Fill in"},null,{"$f":"COUNTIF(N13:N37,\"x\")","v":0},{"$nulls":6},{"$f":"SUM(U13:U37)+X38","v":{"v":0,"d":"0.00"}},{"$f":"SUM(V13:V37)","v":{"v":0,"d":"0.00"}},{"$f":"COUNTA(W13:W37)","v":{"v":0,"d":"0.00"}},{"$f":"SUM(X13:X37)","v":{"v":0,"d":"0.00"}},{"$f":"SUM(Y13:Y37)","v":0}]
[{"$f":"IF(L40>0,\"DON’T FORGET TO ATTACH YOUR RECEIPT DOCUMENTATION TO THE EMAIL\",\"\")","v":""},{"$nulls":9},"Amount from Mileage Log",{"$f":"IF(Summary!O12>3,'Mileage log'!E60+'Mileage log'!E120+'Mileage log'!E180,\"all the yellow\")","v":"all the yellow"}]
[{"$nulls":10},"Number Receipts to be Mailed",{"$f":"IF(FundCode<>500,COUNT(L13:L37),IF(Summary!O12>3,SUM(O13:O37),\"spaces on the\"))","v":0}]
[{"$nulls":11},{"$f":"IF(L38=\"please fill in\",\"spaces on\",\"\")","v":"spaces on"},{"$f":"Summary!O12","v":{"v":1,"d":"1.00"}}]
[{"$nulls":10},"Transportation Grand Total",{"$f":"IF(Summary!O12>3,SUM(L38:L39)+U38,\"summary page\")","v":"summary page"}]

{"sheet":"Mileage log","index":5,"n_rows":180,"n_cols":27,"rows_kept":180,"merged":[[8,0,9,0],[8,1,8,2],[8,3,10,3],[8,4,10,4],[9,11,9,15],[9,19,10,19],[11,12,11,15],[12,12,12,15],[13,12,13,15],[14,12,14,15],[15,12,15,15],[16,12,16,15],[17,12,17,15],[18,12,18,15],[19,12,19,15],[20,12,20,15],[21,12,21,15],[22,12,22,15],[23,12,23,15],[24,12,24,15],[25,12,25,15],[26,12,26,15],[27,12,27,15],[28,12,28,15],[29,12,29,15],[30,12,30,15],[31,12,31,15],[32,12,32,15],[33,12,33,15],[34,12,34,15],[35,12,35,15],[36,12,36,15],[37,12,37,15],[38,12,38,15],[39,12,39,15],[40,12,40,15],[41,12,41,15],[42,12,42,15],[43,12,43,15],[44,12,44,15],[45,12,45,15],[46,12,46,15],[47,12,47,15],[48,12,48,15],[49,12,49,15],[50,12,50,15],[51,12,51,15],[52,12,52,15],[53,12,53,15],[54,12,54,15],[55,12,55,15],[56,12,56,15],[57,12,57,15],[68,0,69,0],[68,1,68,2],[68,3,70,3],[68,4,70,4],[69,11,69,15],[69,19,70,19],[71,12,71,15],[72,12,72,15],[73,12,73,15],[74,12,74,15],[75,12,75,15],[76,12,76,15],[77,12,77,15],[78,12,78,15],[79,12,79,15],[80,12,80,15],[81,12,81,15],[82,12,82,15],[83,12,83,15],[84,12,84,15],[85,12,85,15],[86,12,86,15],[87,12,87,15],[88,12,88,15],[89,12,89,15],[90,12,90,15],[91,12,91,15],[92,12,92,15],[93,12,93,15],[94,12,94,15],[95,12,95,15],[96,12,96,15],[97,12,97,15],[98,12,98,15],[99,12,99,15],[100,12,100,15],[101,12,101,15],[102,12,102,15],[103,12,103,15],[104,12,104,15],[105,12,105,15],[106,12,106,15],[107,12,107,15],[108,12,108,15],[109,12,109,15],[110,12,110,15],[111,12,111,15],[112,12,112,15],[113,12,113,15],[114,12,114,15],[115,12,115,15],[116,12,116,15],[117,12,117,15],[128,0,129,0],[128,1,128,2],[128,3,130,3],[128,4,130,4],[129,11,129,15],[129,19,130,19],[131,12,131,15],[132,12,132,15],[133,12,133,15],[134,12,134,15],[135,12,135,15],[136,12,136,15],[137,12,137,15],[138,12,138,15],[139,12,139,15],[140,12,140,15],[141,12,141,15],[142,12,142,15],[143,12,143,15],[144,12,144,15],[145,12,145,15],[146,12,146,15],[147,12,147,15],[148,12,148,15],[149,12,149,15],[150,12,150,15],[151,12,151,15],[152,12,152,15],[153,12,153,15],[154,12,154,15],[155,12,155,15],[156,12,156,15],[157,12,157,15],[158,12,158,15],[159,12,159,15],[160,12,160,15],[161,12,161,15],[162,12,162,15],[163,12,163,15],[164,12,164,15],[165,12,165,15],[166,12,166,15],[167,12,167,15],[168,12,168,15],[169,12,169,15],[170,12,170,15],[171,12,171,15],[172,12,172,15],[173,12,173,15],[174,12,174,15],[175,12,175,15],[176,12,176,15],[177,12,177,15]]}
[{"$nulls":3},"Staff:",{"$f":"Transportation!K1","v":" "}]
[null,"Abbreviations:","Abbreviations:","Dept/Project",{"$f":"Transportation!K2","v":0}]
[null,"PD=Partnership Development",null,"Month/Year (MM/DD/YY):"]
[null,"ICF=Intl Christian Fellowship",null,"Vehicle/Work/Office Location:"]
[]
[{"$nulls":4},{"$f":"IF(_xlfn.IFNA(VLOOKUP(E2,Z11:AA39,2,),0)=0,\"\",\"IRS Commuting Guidelines Verified\")","v":""},{"$nulls":5},"old rate date","new rate date"]
[{"$nulls":3},{"$f":"IF(H58+H118+H178>0,\"PY=Prior Year Mileage Rate\",\"\")","v":""},{"$nulls":6},{"$f":"K8","v":{"v":43100,"d":"43,100"}},{"$f":"L8","v":{"v":43101,"d":"43,101"}}]
[{"$nulls":10},"2017-12-31","2018-01-01"]
["Date","Destination (name & location)",null,"Ministry Purpose                 (see abbreviation box)","Total Miles",{"$nulls":5},0.535,0.545]
[null,"From","To",{"$nulls":8},"office use only",{"$nulls":4},"amt  +/-","Esception",null,"for audit work",{"$nulls":3},{"$f":"_xlfn.IFNA(VLOOKUP(E2,Z11:AA39,2,),0)","v":0}]
["(mm/dd/yy)","(example: Home or address)","(example: walmart on st. or address)",{"$nulls":5},"old adj","new adj",null,"initials","correction explanation",{"$nulls":12},5136,1]
[{"$nulls":5},{"$f":"IF(A12>0,IF(submit_date>0,IF(submit_date-A12>60,\"disallow\",\"\"),IF(TODAY()-A12>60,\"disallow\",\"\")),\"\")","v":""},{"$f":"IF(OR(C12=\"home\",$X$10=1,C12=\"\"),\"\",IF(ROUNDDOWN(COUNTIF($C$12:C12,C12)/IF((A12-$A$12)<7,(A12+1-$A$12),(A12-$A$12)/7),0)>3,\"Poss Commute\",\"\"))","v":""},{"$f":"IF(A12=0,\"\",IF($A$12<new_rate_date,\"PR\",IF(A12<new_rate_date,\"PR\",\"\")))","v":""},{"$f":"IF($A$12<new_rate_date,0,IF(H12=\"PR\",(E12*old_rate)-(E12*new_rate),0))","v":0},{"$f":"IF($A$12<new_rate_date,IF(A12<new_rate_date,0,IF(H12=\"PR\",(E12*new_rate)-(E12*old_rate),0)),0)","v":0},{"$f":"IF(AND(F12=\"disallow\",R12=0),E12,0)","v":0},{"$nulls":7},{"$f":"IF(R12>0,-Q12,0)","v":0},{"$f":"IF(AND(A12<Fiscal_Start_Date,submit_date-A12<90,submit_date>=Fiscal_Start_Date),E12,0)","v":0},{"$nulls":5},5207,1]
[{"$nulls":5},"",{"$f":"IF(OR(C13=\"home\",$X$10=1,C13=\"\"),\"\",IF(ROUNDDOWN(COUNTIF($C$12:C13,C13)/IF((A13-$A$12)<7,(A13+1-$A$12),(A13-$A$12)/7),0)>3,\"Poss Commute\",\"\"))","v":""},{"$f":"IF(A13=0,\"\",IF($A$12<new_rate_date,\"PR\",IF(A13<new_rate_date,\"PR\",\"\")))","v":""},{"$f":"IF($A$12<new_rate_date,0,IF(H13=\"PR\",(E13*old_rate)-(E13*new_rate),0))","v":0},{"$f":"IF($A$12<new_rate_date,IF(A13<new_rate_date,0,IF(H13=\"PR\",(E13*new_rate)-(E13*old_rate),0)),0)","v":0},{"$f":"IF(AND(F13=\"disallow\",R13=0),E13,0)","v":0},{"$nulls":7},{"$f":"IF(R13>0,-Q13,0)","v":0},0,{"$nulls":5},5214,1]
[{"$nulls":5},"",{"$f":"IF(OR(C14=\"home\",$X$10=1,C14=\"\"),\"\",IF(ROUNDDOWN(COUNTIF($C$12:C14,C14)/IF((A14-$A$12)<7,(A14+1-$A$12),(A14-$A$12)/7),0)>3,\"Poss Commute\",\"\"))","v":""},"",0,0,0,{"$nulls":7},{"$f":"IF(R14>0,-Q14,0)","v":0},0,{"$nulls":5},5311,1]
[{"$nulls":5},"",{"$f":"IF(OR(C15=\"home\",$X$10=1,C15=\"\"),\"\",IF(ROUNDDOWN(COUNTIF($C$12:C15,C15)/IF((A15-$A$12)<7,(A15+1-$A$12),(A15-$A$12)/7),0)>3,\"Poss Commute\",\"\"))","v":""},"",0,0,0,{"$nulls":7},0,0,{"$nulls":5},5317,1]
[{"$nulls":5},"",{"$f":"IF(OR(C16=\"home\",$X$10=1,C16=\"\"),\"\",IF(ROUNDDOWN(COUNTIF($C$12:C16,C16)/IF((A16-$A$12)<7,(A16+1-$A$12),(A16-$A$12)/7),0)>3,\"Poss Commute\",\"\"))","v":""},"",0,0,0,{"$nulls":7},0,0,null,null,{"$f":"IF((A17-$A$12)<7,(A17+1-$A$12),(A17-$A$12)/7)","v":{"v":1,"d":"1.0000"}},null,null,5362,1]
[{"$nulls":5},"",{"$f":"IF(OR(C17=\"home\",$X$10=1,C17=\"\"),\"\",IF(ROUNDDOWN(COUNTIF($C$12:C17,C17)/IF((A17-$A$12)<7,(A17+1-$A$12),(A17-$A$12)/7),0)>3,\"Poss Commute\",\"\"))","v":""},"",0,0,0,{"$nulls":7},0,0,{"$nulls":5},5364,1]
[{"$nulls":5},"",{"$f":"IF(OR(C18=\"home\",$X$10=1,C18=\"\"),\"\",IF(ROUNDDOWN(COUNTIF($C$12:C18,C18)/IF((A18-$A$12)<7,(A18+1-$A$12),(A18-$A$12)/7),0)>3,\"Poss Commute\",\"\"))","v":""},"",0,0,0,{"$nulls":7},0,0,null,null,{"$f":"ROUNDDOWN(COUNTIF($C$12:C17,C17)/W16,0)","v":0},null,null,5383,1]
[{"$nulls":5},"",{"$f":"IF(OR(C19=\"home\",$X$10=1,C19=\"\"),\"\",IF(ROUNDDOWN(COUNTIF($C$12:C19,C19)/IF((A19-$A$12)<7,(A19+1-$A$12),(A19-$A$12)/7),0)>3,\"Poss Commute\",\"\"))","v":""},"",0,0,0,{"$nulls":7},0,0,{"$nulls":5},5386,1]
[{"$nulls":5},"",{"$f":"IF(OR(C20=\"home\",$X$10=1,C20=\"\"),\"\",IF(ROUNDDOWN(COUNTIF($C$12:C20,C20)/IF((A20-$A$12)<7,(A20+1-$A$12),(A20-$A$12)/7),0)>3,\"Poss Commute\",\"\"))","v":""},"",0,0,0,{"$nulls":7},0,0,{"$nulls":5},5394,1]
[{"$nulls":5},"",{"$f":"IF(OR(C21=\"home\",$X$10=1,C21=\"\"),\"\",IF(ROUNDDOWN(COUNTIF($C$12:C21,C21)/IF((A21-$A$12)<7,(A21+1-$A$12),(A21-$A$12)/7),0)>3,\"Poss Commute\",\"\"))","v":""},"",0,0,0,{"$nulls":7},0,0,{"$nulls":5},5480,1]
[{"$nulls":5},"",{"$f":"IF(OR(C22=\"home\",$X$10=1,C22=\"\"),\"\",IF(ROUNDDOWN(COUNTIF($C$12:C22,C22)/IF((A22-$A$12)<7,(A22+1-$A$12),(A22-$A$12)/7),0)>3,\"Poss Commute\",\"\"))","v":""},"",{"$f":"IF($A$12<new_rate_date,0,IF(H22=\"PR\",(E22*old_rate)-(E22*new_rate),0))","v":0},{"$f":"IF($A$12<new_rate_date,IF(A22<new_rate_date,0,IF(H22=\"PR\",(E22*new_rate)-(E22*old_rate),0)),0)","v":0},0,{"$nulls":7},0,0,{"$nulls":5},5481,1]
[{"$nulls":5},"",{"$f":"IF(OR(C23=\"home\",$X$10=1,C23=\"\"),\"\",IF(ROUNDDOWN(COUNTIF($C$12:C23,C23)/IF((A23-$A$12)<7,(A23+1-$A$12),(A23-$A$12)/7),0)>3,\"Poss Commute\",\"\"))","v":""},"",0,0,0,{"$nulls":7},0,0,{"$nulls":5},5483,1]
[{"$nulls":5},"",{"$f":"IF(OR(C24=\"home\",$X$10=1,C24=\"\"),\"\",IF(ROUNDDOWN(COUNTIF($C$12:C24,C24)/IF((A24-$A$12)<7,(A24+1-$A$12),(A24-$A$12)/7),0)>3,\"Poss Commute\",\"\"))","v":""},"",0,0,0,{"$nulls":7},0,0,{"$nulls":5},5488,1]
[{"$nulls":5},"",{"$f":"IF(OR(C25=\"home\",$X$10=1,C25=\"\"),\"\",IF(ROUNDDOWN(COUNTIF($C$12:C25,C25)/IF((A25-$A$12)<7,(A25+1-$A$12),(A25-$A$12)/7),0)>3,\"Poss Commute\",\"\"))","v":""},"",0,0,0,{"$nulls":7},0,0,{"$nulls":5},5489,1]
[{"$nulls":5},"",{"$f":"IF(OR(C26=\"home\",$X$10=1,C26=\"\"),\"\",IF(ROUNDDOWN(COUNTIF($C$12:C26,C26)/IF((A26-$A$12)<7,(A26+1-$A$12),(A26-$A$12)/7),0)>3,\"Poss Commute\",\"\"))","v":""},"",0,0,0,{"$nulls":7},0,0,{"$nulls":5},5505,1]
[{"$nulls":5},"",{"$f":"IF(OR(C27=\"home\",$X$10=1,C27=\"\"),\"\",IF(ROUNDDOWN(COUNTIF($C$12:C27,C27)/IF((A27-$A$12)<7,(A27+1-$A$12),(A27-$A$12)/7),0)>3,\"Poss Commute\",\"\"))","v":""},"",0,0,0,{"$nulls":7},0,0,{"$nulls":5},5512,1]
[{"$nulls":5},"",{"$f":"IF(OR(C28=\"home\",$X$10=1,C28=\"\"),\"\",IF(ROUNDDOWN(COUNTIF($C$12:C28,C28)/IF((A28-$A$12)<7,(A28+1-$A$12),(A28-$A$12)/7),0)>3,\"Poss Commute\",\"\"))","v":""},"",0,0,0,{"$nulls":7},0,0,{"$nulls":5},5536,1]
[{"$nulls":5},"",{"$f":"IF(OR(C29=\"home\",$X$10=1,C29=\"\"),\"\",IF(ROUNDDOWN(COUNTIF($C$12:C29,C29)/IF((A29-$A$12)<7,(A29+1-$A$12),(A29-$A$12)/7),0)>3,\"Poss Commute\",\"\"))","v":""},"",0,0,0,{"$nulls":7},0,0,{"$nulls":5},5537,1]
[{"$nulls":5},"",{"$f":"IF(OR(C30=\"home\",$X$10=1,C30=\"\"),\"\",IF(ROUNDDOWN(COUNTIF($C$12:C30,C30)/IF((A30-$A$12)<7,(A30+1-$A$12),(A30-$A$12)/7),0)>3,\"Poss Commute\",\"\"))","v":""},"",0,0,0,{"$nulls":7},0,0,{"$nulls":5},5563,1]
[{"$nulls":5},"",{"$f":"IF(OR(C31=\"home\",$X$10=1,C31=\"\"),\"\",IF(ROUNDDOWN(COUNTIF($C$12:C31,C31)/IF((A31-$A$12)<7,(A31+1-$A$12),(A31-$A$12)/7),0)>3,\"Poss Commute\",\"\"))","v":""},"",0,0,0,{"$nulls":7},0,0,{"$nulls":5},5572,1]
[{"$nulls":5},"",{"$f":"IF(OR(C32=\"home\",$X$10=1,C32=\"\"),\"\",IF(ROUNDDOWN(COUNTIF($C$12:C32,C32)/IF((A32-$A$12)<7,(A32+1-$A$12),(A32-$A$12)/7),0)>3,\"Poss Commute\",\"\"))","v":""},"",0,0,0,{"$nulls":7},0,0,{"$nulls":5},5581,1]
[{"$nulls":5},"",{"$f":"IF(OR(C33=\"home\",$X$10=1,C33=\"\"),\"\",IF(ROUNDDOWN(COUNTIF($C$12:C33,C33)/IF((A33-$A$12)<7,(A33+1-$A$12),(A33-$A$12)/7),0)>3,\"Poss Commute\",\"\"))","v":""},"",0,0,0,{"$nulls":7},0,0,{"$nulls":5},5634,1]
[{"$nulls":5},"",{"$f":"IF(OR(C34=\"home\",$X$10=1,C34=\"\"),\"\",IF(ROUNDDOWN(COUNTIF($C$12:C34,C34)/IF((A34-$A$12)<7,(A34+1-$A$12),(A34-$A$12)/7),0)>3,\"Poss Commute\",\"\"))","v":""},"",0,0,0,{"$nulls":7},0,0,{"$nulls":5},5662,1]
[{"$nulls":5},"",{"$f":"IF(OR(C35=\"home\",$X$10=1,C35=\"\"),\"\",IF(ROUNDDOWN(COUNTIF($C$12:C35,C35)/IF((A35-$A$12)<7,(A35+1-$A$12),(A35-$A$12)/7),0)>3,\"Poss Commute\",\"\"))","v":""},"",0,0,0,{"$nulls":7},0,0,{"$nulls":5},5743,1]
[{"$nulls":5},"",{"$f":"IF(OR(C36=\"home\",$X$10=1,C36=\"\"),\"\",IF(ROUNDDOWN(COUNTIF($C$12:C36,C36)/IF((A36-$A$12)<7,(A36+1-$A$12),(A36-$A$12)/7),0)>3,\"Poss Commute\",\"\"))","v":""},"",0,0,0,{"$nulls":7},0,0,{"$nulls":5},5754,1]
[{"$nulls":5},"",{"$f":"IF(OR(C37=\"home\",$X$10=1,C37=\"\"),\"\",IF(ROUNDDOWN(COUNTIF($C$12:C37,C37)/IF((A37-$A$12)<7,(A37+1-$A$12),(A37-$A$12)/7),0)>3,\"Poss Commute\",\"\"))","v":""},"",0,0,0,{"$nulls":7},0,0,{"$nulls":5},5764,1]
[{"$nulls":5},"",{"$f":"IF(OR(C38=\"home\",$X$10=1,C38=\"\"),\"\",IF(ROUNDDOWN(COUNTIF($C$12:C38,C38)/IF((A38-$A$12)<7,(A38+1-$A$12),(A38-$A$12)/7),0)>3,\"Poss Commute\",\"\"))","v":""},"",0,0,0,{"$nulls":7},0,0,{"$nulls":5},5776,1]
[{"$nulls":5},"",{"$f":"IF(OR(C39=\"home\",$X$10=1,C39=\"\"),\"\",IF(ROUNDDOWN(COUNTIF($C$12:C39,C39)/IF((A39-$A$12)<7,(A39+1-$A$12),(A39-$A$12)/7),0)>3,\"Poss Commute\",\"\"))","v":""},"",0,0,0,{"$nulls":7},0,0,{"$nulls":5},5949,1]
[{"$nulls":5},"",{"$f":"IF(OR(C40=\"home\",$X$10=1,C40=\"\"),\"\",IF(ROUNDDOWN(COUNTIF($C$12:C40,C40)/IF((A40-$A$12)<7,(A40+1-$A$12),(A40-$A$12)/7),0)>3,\"Poss Commute\",\"\"))","v":""},"",0,0,0,{"$nulls":7},0,0]
[{"$nulls":5},"",{"$f":"IF(OR(C41=\"home\",$X$10=1,C41=\"\"),\"\",IF(ROUNDDOWN(COUNTIF($C$12:C41,C41)/IF((A41-$A$12)<7,(A41+1-$A$12),(A41-$A$12)/7),0)>3,\"Poss Commute\",\"\"))","v":""},"",0,0,0,{"$nulls":7},0,0]
[{"$nulls":5},"",{"$f":"IF(OR(C42=\"home\",$X$10=1,C42=\"\"),\"\",IF(ROUNDDOWN(COUNTIF($C$12:C42,C42)/IF((A42-$A$12)<7,(A42+1-$A$12),(A42-$A$12)/7),0)>3,\"Poss Commute\",\"\"))","v":""},"",0,0,0,{"$nulls":7},0,0]
[{"$nulls":5},"",{"$f":"IF(OR(C43=\"home\",$X$10=1,C43=\"\"),\"\",IF(ROUNDDOWN(COUNTIF($C$12:C43,C43)/IF((A43-$A$12)<7,(A43+1-$A$12),(A43-$A$12)/7),0)>3,\"Poss Commute\",\"\"))","v":""},"",0,0,0,{"$nulls":7},0,0]
[{"$nulls":5},"",{"$f":"IF(OR(C44=\"home\",$X$10=1,C44=\"\"),\"\",IF(ROUNDDOWN(COUNTIF($C$12:C44,C44)/IF((A44-$A$12)<7,(A44+1-$A$12),(A44-$A$12)/7),0)>3,\"Poss Commute\",\"\"))","v":""},"",0,0,0,{"$nulls":7},0,0]
[{"$nulls":5},"",{"$f":"IF(OR(C45=\"home\",$X$10=1,C45=\"\"),\"\",IF(ROUNDDOWN(COUNTIF($C$12:C45,C45)/IF((A45-$A$12)<7,(A45+1-$A$12),(A45-$A$12)/7),0)>3,\"Poss Commute\",\"\"))","v":""},"",0,0,0,{"$nulls":7},0,0]
[{"$nulls":5},"",{"$f":"IF(OR(C46=\"home\",$X$10=1,C46=\"\"),\"\",IF(ROUNDDOWN(COUNTIF($C$12:C46,C46)/IF((A46-$A$12)<7,(A46+1-$A$12),(A46-$A$12)/7),0)>3,\"Poss Commute\",\"\"))","v":""},"",0,0,0,{"$nulls":7},0,0]
[{"$nulls":5},"",{"$f":"IF(OR(C47=\"home\",$X$10=1,C47=\"\"),\"\",IF(ROUNDDOWN(COUNTIF($C$12:C47,C47)/IF((A47-$A$12)<7,(A47+1-$A$12),(A47-$A$12)/7),0)>3,\"Poss Commute\",\"\"))","v":""},"",0,0,0,{"$nulls":7},0,0]
[{"$nulls":5},"",{"$f":"IF(OR(C48=\"home\",$X$10=1,C48=\"\"),\"\",IF(ROUNDDOWN(COUNTIF($C$12:C48,C48)/IF((A48-$A$12)<7,(A48+1-$A$12),(A48-$A$12)/7),0)>3,\"Poss Commute\",\"\"))","v":""},"",0,0,0,{"$nulls":7},0,0]
[{"$nulls":5},"",{"$f":"IF(OR(C49=\"home\",$X$10=1,C49=\"\"),\"\",IF(ROUNDDOWN(COUNTIF($C$12:C49,C49)/IF((A49-$A$12)<7,(A49+1-$A$12),(A49-$A$12)/7),0)>3,\"Poss Commute\",\"\"))","v":""},"",0,0,0,{"$nulls":7},0,0]
[{"$nulls":5},"",{"$f":"IF(OR(C50=\"home\",$X$10=1,C50=\"\"),\"\",IF(ROUNDDOWN(COUNTIF($C$12:C50,C50)/IF((A50-$A$12)<7,(A50+1-$A$12),(A50-$A$12)/7),0)>3,\"Poss Commute\",\"\"))","v":""},"",0,0,0,{"$nulls":7},0,0,{"$f":"IF(A50=\"\",\"\",IF((A50-$A$12)<7,(A50+1-$A$12),(A50-$A$12)/7))","v":""}]
[{"$nulls":5},"",{"$f":"IF(OR(C51=\"home\",$X$10=1,C51=\"\"),\"\",IF(ROUNDDOWN(COUNTIF($C$12:C51,C51)/IF((A51-$A$12)<7,(A51+1-$A$12),(A51-$A$12)/7),0)>3,\"Poss Commute\",\"\"))","v":""},"",0,0,0,{"$nulls":7},0,0,""]
[{"$nulls":5},"",{"$f":"IF(OR(C52=\"home\",$X$10=1,C52=\"\"),\"\",IF(ROUNDDOWN(COUNTIF($C$12:C52,C52)/IF((A52-$A$12)<7,(A52+1-$A$12),(A52-$A$12)/7),0)>3,\"Poss Commute\",\"\"))","v":""},"",0,0,0,{"$nulls":7},0,0,""]
[{"$nulls":5},"",{"$f":"IF(OR(C53=\"home\",$X$10=1,C53=\"\"),\"\",IF(ROUNDDOWN(COUNTIF($C$12:C53,C53)/IF((A53-$A$12)<7,(A53+1-$A$12),(A53-$A$12)/7),0)>3,\"Poss Commute\",\"\"))","v":""},"",0,0,0,{"$nulls":7},0,0,""]
[{"$nulls":5},"",{"$f":"IF(OR(C54=\"home\",$X$10=1,C54=\"\"),\"\",IF(ROUNDDOWN(COUNTIF($C$12:C54,C54)/IF((A54-$A$12)<7,(A54+1-$A$12),(A54-$A$12)/7),0)>3,\"Poss Commute\",\"\"))","v":""},"",0,0,0,{"$nulls":7},0,0,""]
[{"$nulls":5},"",{"$f":"IF(OR(C55=\"home\",$X$10=1,C55=\"\"),\"\",IF(ROUNDDOWN(COUNTIF($C$12:C55,C55)/IF((A55-$A$12)<7,(A55+1-$A$12),(A55-$A$12)/7),0)>3,\"Poss Commute\",\"\"))","v":""},"",0,0,0,{"$nulls":7},0,0,""]
[{"$nulls":5},"",{"$f":"IF(OR(C56=\"home\",$X$10=1,C56=\"\"),\"\",IF(ROUNDDOWN(COUNTIF($C$12:C56,C56)/IF((A56-$A$12)<7,(A56+1-$A$12),(A56-$A$12)/7),0)>3,\"Poss Commute\",\"\"))","v":""},"",0,0,0,{"$nulls":7},0,0,""]
[{"$nulls":5},"",{"$f":"IF(OR(C57=\"home\",$X$10=1,C57=\"\"),\"\",IF(ROUNDDOWN(COUNTIF($C$12:C57,C57)/IF((A57-$A$12)<7,(A57+1-$A$12),(A57-$A$12)/7),0)>3,\"Poss Commute\",\"\"))","v":""},"",0,0,0,{"$nulls":7},0,0,""]
[{"$nulls":3},"Total Miles",{"$f":"IF(F59>3,SUM(E12:E57)-K58+Q58,\"Please fill in\")","v":"Please fill in"},null,null,{"$f":"COUNTIF(G12:G57,\"PR\")","v":0},{"$f":"SUM(I12:I57)","v":0},{"$f":"SUM(J12:J57)","v":0},{"$f":"SUM(K12:K57)","v":0},null,{"$f":"M57&M56&M55&M54&M53&M52&M51&M50&M49&M48&M47&M46&M45&M44&M43&M42&M41&M40&M39&M38&M37&M36&M35&M34&M33&M32&M31&M30&M29&M28&M27&M26&M25&M24&M23&M22&M21&M20&M19&M18&M17&M16&M15&M14&M13&M12","v":""},{"$nulls":3},{"$f":"SUM(Q12:Q57)+S58","v":0},{"$f":"COUNTA(R12:R57)","v":0},{"$f":"SUM(S12:S57)","v":0},{"$f":"SUM(T12:T57)","v":0}]
[{"$nulls":3},"Rate/Mile",{"$f":"IF(F59>3,IF(A12=0,new_rate,IF(A12<L7,old_rate,new_rate)),\"the yellow spaces\")","v":"the yellow spaces"},{"$f":"Summary!O12","v":1}]
[{"$nulls":3},"Total in $$",{"$f":"IF(F59>3,(E58*E59)+I58+J58,\"on summary page\")","v":"on summary page"}]
[{"$nulls":3},"Staff:",{"$f":"E1","v":" "}]
[null,null,"Abbreviations:","Dept/Project",{"$f":"E2","v":0}]
[null,null,"PD=Partnership Development","Month/Year (MM/DD/YY):"]
[null,null,"ICF=International Christian Fellowship","Vehicle/Work/Office Location:"]
[]
[{"$nulls":4},{"$f":"E6","v":""},{"$nulls":5},"old rate date","new rate date"]
[{"$nulls":3},{"$f":"IF(H118>0,\"PY=Prior Year Mileage Rate\",\"\")","v":""},{"$nulls":6},{"$f":"K68","v":{"v":43100,"d":"43,100"}},{"$f":"L68","v":{"v":43101,"d":"43,101"}}]
[{"$nulls":10},{"$f":"K8","v":"2017-12-31"},{"$f":"L8","v":"2018-01-01"}]
["Date","Destination (name & location)",null,"Ministry Purpose                 (see abbreviation box)","Total Miles",{"$nulls":5},{"$f":"K9","v":0.535},{"$f":"L9","v":0.545}]
[null,"From","To",{"$nulls":8},"office use only",{"$nulls":4},"amt  +/-","Esception",null,"for audit work"]
["(mm/dd/yy)","(example: Home or address)","(example: walmart on st. or address)",{"$nulls":5},"old adj","new adj",null,"initials","correction explanation"]
[{"$nulls":5},{"$f":"IF(A72>0,IF(submit_date>0,IF(submit_date-A72>60,\"disallow\",\"\"),IF(TODAY()-A72>60,\"disallow\",\"\")),\"\")","v":""},{"$f":"IF(OR(C72=\"home\",$X$10=1,C72=\"\"),\"\",IF(ROUNDDOWN(COUNTIF($C$12:C72,C72)/IF((A72-$A$12)<7,(A72+1-$A$12),(A72-$A$12)/7),0)>3,\"Poss Commute\",\"\"))","v":""},{"$f":"IF(A72=0,\"\",IF($A$12<new_rate_date,\"PR\",IF(A72<new_rate_date,\"PR\",\"\")))","v":""},{"$f":"IF($A$12<new_rate_date,0,IF(H72=\"PR\",(E72*old_rate)-(E72*new_rate),0))","v":0},{"$f":"IF($A$12<new_rate_date,IF(A72<new_rate_date,0,IF(H72=\"PR\",(E72*new_rate)-(E72*old_rate),0)),0)","v":0},{"$f":"IF(AND(F72=\"disallow\",R72=0),E72,0)","v":0},{"$nulls":7},{"$f":"IF(R72>0,-Q72,0)","v":0},{"$f":"IF(AND(A72<Fiscal_Start_Date,submit_date-A72<90,submit_date>=Fiscal_Start_Date),E72,0)","v":0}]
[{"$nulls":5},"",{"$f":"IF(OR(C73=\"home\",$X$10=1,C73=\"\"),\"\",IF(ROUNDDOWN(COUNTIF($C$12:C73,C73)/IF((A73-$A$12)<7,(A73+1-$A$12),(A73-$A$12)/7),0)>3,\"Poss Commute\",\"\"))","v":""},{"$f":"IF(A73=0,\"\",IF($A$12<new_rate_date,\"PR\",IF(A73<new_rate_date,\"PR\",\"\")))","v":""},{"$f":"IF($A$12<new_rate_date,0,IF(H73=\"PR\",(E73*old_rate)-(E73*new_rate),0))","v":0},{"$f":"IF($A$12<new_rate_date,IF(A73<new_rate_date,0,IF(H73=\"PR\",(E73*new_rate)-(E73*old_rate),0)),0)","v":0},{"$f":"IF(AND(F73=\"disallow\",R73=0),E73,0)","v":0},{"$nulls":7},{"$f":"IF(R73>0,-Q73,0)","v":0},0]
[{"$nulls":5},"",{"$f":"IF(OR(C74=\"home\",$X$10=1,C74=\"\"),\"\",IF(ROUNDDOWN(COUNTIF($C$12:C74,C74)/IF((A74-$A$12)<7,(A74+1-$A$12),(A74-$A$12)/7),0)>3,\"Poss Commute\",\"\"))","v":""},"",0,0,0,{"$nulls":7},{"$f":"IF(R74>0,-Q74,0)","v":0},0]
[{"$nulls":5},"",{"$f":"IF(OR(C75=\"home\",$X$10=1,C75=\"\"),\"\",IF(ROUNDDOWN(COUNTIF($C$12:C75,C75)/IF((A75-$A$12)<7,(A75+1-$A$12),(A75-$A$12)/7),0)>3,\"Poss Commute\",\"\"))","v":""},"",0,0,0,{"$nulls":7},0,0]
[{"$nulls":5},"",{"$f":"IF(OR(C76=\"home\",$X$10=1,C76=\"\"),\"\",IF(ROUNDDOWN(COUNTIF($C$12:C76,C76)/IF((A76-$A$12)<7,(A76+1-$A$12),(A76-$A$12)/7),0)>3,\"Poss Commute\",\"\"))","v":""},"",0,0,0,{"$nulls":7},0,0]
[{"$nulls":5},"",{"$f":"IF(OR(C77=\"home\",$X$10=1,C77=\"\"),\"\",IF(ROUNDDOWN(COUNTIF($C$12:C77,C77)/IF((A77-$A$12)<7,(A77+1-$A$12),(A77-$A$12)/7),0)>3,\"Poss Commute\",\"\"))","v":""},"",0,0,0,{"$nulls":7},0,0]
[{"$nulls":5},"",{"$f":"IF(OR(C78=\"home\",$X$10=1,C78=\"\"),\"\",IF(ROUNDDOWN(COUNTIF($C$12:C78,C78)/IF((A78-$A$12)<7,(A78+1-$A$12),(A78-$A$12)/7),0)>3,\"Poss Commute\",\"\"))","v":""},"",0,0,0,{"$nulls":7},0,0]
[{"$nulls":5},"",{"$f":"IF(OR(C79=\"home\",$X$10=1,C79=\"\"),\"\",IF(ROUNDDOWN(COUNTIF($C$12:C79,C79)/IF((A79-$A$12)<7,(A79+1-$A$12),(A79-$A$12)/7),0)>3,\"Poss Commute\",\"\"))","v":""},"",0,0,0,{"$nulls":7},0,0]
[{"$nulls":5},"",{"$f":"IF(OR(C80=\"home\",$X$10=1,C80=\"\"),\"\",IF(ROUNDDOWN(COUNTIF($C$12:C80,C80)/IF((A80-$A$12)<7,(A80+1-$A$12),(A80-$A$12)/7),0)>3,\"Poss Commute\",\"\"))","v":""},"",0,0,0,{"$nulls":7},0,0]
[{"$nulls":5},"",{"$f":"IF(OR(C81=\"home\",$X$10=1,C81=\"\"),\"\",IF(ROUNDDOWN(COUNTIF($C$12:C81,C81)/IF((A81-$A$12)<7,(A81+1-$A$12),(A81-$A$12)/7),0)>3,\"Poss Commute\",\"\"))","v":""},"",0,0,0,{"$nulls":7},0,0]
[{"$nulls":5},"",{"$f":"IF(OR(C82=\"home\",$X$10=1,C82=\"\"),\"\",IF(ROUNDDOWN(COUNTIF($C$12:C82,C82)/IF((A82-$A$12)<7,(A82+1-$A$12),(A82-$A$12)/7),0)>3,\"Poss Commute\",\"\"))","v":""},"",0,0,0,{"$nulls":7},0,0]
[{"$nulls":5},"",{"$f":"IF(OR(C83=\"home\",$X$10=1,C83=\"\"),\"\",IF(ROUNDDOWN(COUNTIF($C$12:C83,C83)/IF((A83-$A$12)<7,(A83+1-$A$12),(A83-$A$12)/7),0)>3,\"Poss Commute\",\"\"))","v":""},"",0,0,0,{"$nulls":7},0,0]
[{"$nulls":5},"",{"$f":"IF(OR(C84=\"home\",$X$10=1,C84=\"\"),\"\",IF(ROUNDDOWN(COUNTIF($C$12:C84,C84)/IF((A84-$A$12)<7,(A84+1-$A$12),(A84-$A$12)/7),0)>3,\"Poss Commute\",\"\"))","v":""},"",0,0,0,{"$nulls":7},0,0]
[{"$nulls":5},"",{"$f":"IF(OR(C85=\"home\",$X$10=1,C85=\"\"),\"\",IF(ROUNDDOWN(COUNTIF($C$12:C85,C85)/IF((A85-$A$12)<7,(A85+1-$A$12),(A85-$A$12)/7),0)>3,\"Poss Commute\",\"\"))","v":""},"",0,0,0,{"$nulls":7},0,0]
[{"$nulls":5},"",{"$f":"IF(OR(C86=\"home\",$X$10=1,C86=\"\"),\"\",IF(ROUNDDOWN(COUNTIF($C$12:C86,C86)/IF((A86-$A$12)<7,(A86+1-$A$12),(A86-$A$12)/7),0)>3,\"Poss Commute\",\"\"))","v":""},"",0,0,0,{"$nulls":7},0,0]
[{"$nulls":5},"",{"$f":"IF(OR(C87=\"home\",$X$10=1,C87=\"\"),\"\",IF(ROUNDDOWN(COUNTIF($C$12:C87,C87)/IF((A87-$A$12)<7,(A87+1-$A$12),(A87-$A$12)/7),0)>3,\"Poss Commute\",\"\"))","v":""},"",0,0,0,{"$nulls":7},0,0]
[{"$nulls":5},"",{"$f":"IF(OR(C88=\"home\",$X$10=1,C88=\"\"),\"\",IF(ROUNDDOWN(COUNTIF($C$12:C88,C88)/IF((A88-$A$12)<7,(A88+1-$A$12),(A88-$A$12)/7),0)>3,\"Poss Commute\",\"\"))","v":""},"",0,0,0,{"$nulls":7},0,0]
[{"$nulls":5},"",{"$f":"IF(OR(C89=\"home\",$X$10=1,C89=\"\"),\"\",IF(ROUNDDOWN(COUNTIF($C$12:C89,C89)/IF((A89-$A$12)<7,(A89+1-$A$12),(A89-$A$12)/7),0)>3,\"Poss Commute\",\"\"))","v":""},"",0,0,0,{"$nulls":7},0,0]
[{"$nulls":5},"",{"$f":"IF(OR(C90=\"home\",$X$10=1,C90=\"\"),\"\",IF(ROUNDDOWN(COUNTIF($C$12:C90,C90)/IF((A90-$A$12)<7,(A90+1-$A$12),(A90-$A$12)/7),0)>3,\"Poss Commute\",\"\"))","v":""},"",0,0,0,{"$nulls":7},0,0]
[{"$nulls":5},"",{"$f":"IF(OR(C91=\"home\",$X$10=1,C91=\"\"),\"\",IF(ROUNDDOWN(COUNTIF($C$12:C91,C91)/IF((A91-$A$12)<7,(A91+1-$A$12),(A91-$A$12)/7),0)>3,\"Poss Commute\",\"\"))","v":""},"",0,0,0,{"$nulls":7},0,0]
[{"$nulls":5},"",{"$f":"IF(OR(C92=\"home\",$X$10=1,C92=\"\"),\"\",IF(ROUNDDOWN(COUNTIF($C$12:C92,C92)/IF((A92-$A$12)<7,(A92+1-$A$12),(A92-$A$12)/7),0)>3,\"Poss Commute\",\"\"))","v":""},"",0,0,0,{"$nulls":7},0,0]
[{"$nulls":5},"",{"$f":"IF(OR(C93=\"home\",$X$10=1,C93=\"\"),\"\",IF(ROUNDDOWN(COUNTIF($C$12:C93,C93)/IF((A93-$A$12)<7,(A93+1-$A$12),(A93-$A$12)/7),0)>3,\"Poss Commute\",\"\"))","v":""},"",0,0,0,{"$nulls":7},0,0]
[{"$nulls":5},"",{"$f":"IF(OR(C94=\"home\",$X$10=1,C94=\"\"),\"\",IF(ROUNDDOWN(COUNTIF($C$12:C94,C94)/IF((A94-$A$12)<7,(A94+1-$A$12),(A94-$A$12)/7),0)>3,\"Poss Commute\",\"\"))","v":""},"",0,0,0,{"$nulls":7},0,0]
[{"$nulls":5},"",{"$f":"IF(OR(C95=\"home\",$X$10=1,C95=\"\"),\"\",IF(ROUNDDOWN(COUNTIF($C$12:C95,C95)/IF((A95-$A$12)<7,(A95+1-$A$12),(A95-$A$12)/7),0)>3,\"Poss Commute\",\"\"))","v":""},"",0,0,0,{"$nulls":7},0,0]
[{"$nulls":5},"",{"$f":"IF(OR(C96=\"home\",$X$10=1,C96=\"\"),\"\",IF(ROUNDDOWN(COUNTIF($C$12:C96,C96)/IF((A96-$A$12)<7,(A96+1-$A$12),(A96-$A$12)/7),0)>3,\"Poss Commute\",\"\"))","v":""},"",0,0,0,{"$nulls":7},0,0]
[{"$nulls":5},"",{"$f":"IF(OR(C97=\"home\",$X$10=1,C97=\"\"),\"\",IF(ROUNDDOWN(COUNTIF($C$12:C97,C97)/IF((A97-$A$12)<7,(A97+1-$A$12),(A97-$A$12)/7),0)>3,\"Poss Commute\",\"\"))","v":""},"",0,0,0,{"$nulls":7},0,0]
[{"$nulls":5},"",{"$f":"IF(OR(C98=\"home\",$X$10=1,C98=\"\"),\"\",IF(ROUNDDOWN(COUNTIF($C$12:C98,C98)/IF((A98-$A$12)<7,(A98+1-$A$12),(A98-$A$12)/7),0)>3,\"Poss Commute\",\"\"))","v":""},"",0,0,0,{"$nulls":7},0,0]
[{"$nulls":5},"",{"$f":"IF(OR(C99=\"home\",$X$10=1,C99=\"\"),\"\",IF(ROUNDDOWN(COUNTIF($C$12:C99,C99)/IF((A99-$A$12)<7,(A99+1-$A$12),(A99-$A$12)/7),0)>3,\"Poss Commute\",\"\"))","v":""},"",0,0,0,{"$nulls":7},0,0]
[{"$nulls":5},"",{"$f":"IF(OR(C100=\"home\",$X$10=1,C100=\"\"),\"\",IF(ROUNDDOWN(COUNTIF($C$12:C100,C100)/IF((A100-$A$12)<7,(A100+1-$A$12),(A100-$A$12)/7),0)>3,\"Poss Commute\",\"\"))","v":""},"",0,0,0,{"$nulls":7},0,0]
[{"$nulls":5},"",{"$f":"IF(OR(C101=\"home\",$X$10=1,C101=\"\"),\"\",IF(ROUNDDOWN(COUNTIF($C$12:C101,C101)/IF((A101-$A$12)<7,(A101+1-$A$12),(A101-$A$12)/7),0)>3,\"Poss Commute\",\"\"))","v":""},"",0,0,0,{"$nulls":7},0,0]
[{"$nulls":5},"",{"$f":"IF(OR(C102=\"home\",$X$10=1,C102=\"\"),\"\",IF(ROUNDDOWN(COUNTIF($C$12:C102,C102)/IF((A102-$A$12)<7,(A102+1-$A$12),(A102-$A$12)/7),0)>3,\"Poss Commute\",\"\"))","v":""},"",0,0,0,{"$nulls":7},0,0]
[{"$nulls":5},"",{"$f":"IF(OR(C103=\"home\",$X$10=1,C103=\"\"),\"\",IF(ROUNDDOWN(COUNTIF($C$12:C103,C103)/IF((A103-$A$12)<7,(A103+1-$A$12),(A103-$A$12)/7),0)>3,\"Poss Commute\",\"\"))","v":""},"",0,0,0,{"$nulls":7},0,0]
[{"$nulls":5},"",{"$f":"IF(OR(C104=\"home\",$X$10=1,C104=\"\"),\"\",IF(ROUNDDOWN(COUNTIF($C$12:C104,C104)/IF((A104-$A$12)<7,(A104+1-$A$12),(A104-$A$12)/7),0)>3,\"Poss Commute\",\"\"))","v":""},"",0,0,0,{"$nulls":7},0,0]
[{"$nulls":5},"",{"$f":"IF(OR(C105=\"home\",$X$10=1,C105=\"\"),\"\",IF(ROUNDDOWN(COUNTIF($C$12:C105,C105)/IF((A105-$A$12)<7,(A105+1-$A$12),(A105-$A$12)/7),0)>3,\"Poss Commute\",\"\"))","v":""},"",0,0,0,{"$nulls":7},0,0]
[{"$nulls":5},"",{"$f":"IF(OR(C106=\"home\",$X$10=1,C106=\"\"),\"\",IF(ROUNDDOWN(COUNTIF($C$12:C106,C106)/IF((A106-$A$12)<7,(A106+1-$A$12),(A106-$A$12)/7),0)>3,\"Poss Commute\",\"\"))","v":""},"",0,0,0,{"$nulls":7},0,0]
[{"$nulls":5},"",{"$f":"IF(OR(C107=\"home\",$X$10=1,C107=\"\"),\"\",IF(ROUNDDOWN(COUNTIF($C$12:C107,C107)/IF((A107-$A$12)<7,(A107+1-$A$12),(A107-$A$12)/7),0)>3,\"Poss Commute\",\"\"))","v":""},"",0,0,0,{"$nulls":7},0,0]
[{"$nulls":5},"",{"$f":"IF(OR(C108=\"home\",$X$10=1,C108=\"\"),\"\",IF(ROUNDDOWN(COUNTIF($C$12:C108,C108)/IF((A108-$A$12)<7,(A108+1-$A$12),(A108-$A$12)/7),0)>3,\"Poss Commute\",\"\"))","v":""},"",0,0,0,{"$nulls":7},0,0]
[{"$nulls":5},"",{"$f":"IF(OR(C109=\"home\",$X$10=1,C109=\"\"),\"\",IF(ROUNDDOWN(COUNTIF($C$12:C109,C109)/IF((A109-$A$12)<7,(A109+1-$A$12),(A109-$A$12)/7),0)>3,\"Poss Commute\",\"\"))","v":""},"",0,0,0,{"$nulls":7},0,0]
[{"$nulls":5},"",{"$f":"IF(OR(C110=\"home\",$X$10=1,C110=\"\"),\"\",IF(ROUNDDOWN(COUNTIF($C$12:C110,C110)/IF((A110-$A$12)<7,(A110+1-$A$12),(A110-$A$12)/7),0)>3,\"Poss Commute\",\"\"))","v":""},"",0,0,0,{"$nulls":7},0,0]
[{"$nulls":5},"",{"$f":"IF(OR(C111=\"home\",$X$10=1,C111=\"\"),\"\",IF(ROUNDDOWN(COUNTIF($C$12:C111,C111)/IF((A111-$A$12)<7,(A111+1-$A$12),(A111-$A$12)/7),0)>3,\"Poss Commute\",\"\"))","v":""},"",0,0,0,{"$nulls":7},0,0]
[{"$nulls":5},"",{"$f":"IF(OR(C112=\"home\",$X$10=1,C112=\"\"),\"\",IF(ROUNDDOWN(COUNTIF($C$12:C112,C112)/IF((A112-$A$12)<7,(A112+1-$A$12),(A112-$A$12)/7),0)>3,\"Poss Commute\",\"\"))","v":""},"",0,0,0,{"$nulls":7},0,0]
[{"$nulls":5},"",{"$f":"IF(OR(C113=\"home\",$X$10=1,C113=\"\"),\"\",IF(ROUNDDOWN(COUNTIF($C$12:C113,C113)/IF((A113-$A$12)<7,(A113+1-$A$12),(A113-$A$12)/7),0)>3,\"Poss Commute\",\"\"))","v":""},"",0,0,0,{"$nulls":7},0,0]
[{"$nulls":5},"",{"$f":"IF(OR(C114=\"home\",$X$10=1,C114=\"\"),\"\",IF(ROUNDDOWN(COUNTIF($C$12:C114,C114)/IF((A114-$A$12)<7,(A114+1-$A$12),(A114-$A$12)/7),0)>3,\"Poss Commute\",\"\"))","v":""},"",0,0,0,{"$nulls":7},0,0]
[{"$nulls":5},"",{"$f":"IF(OR(C115=\"home\",$X$10=1,C115=\"\"),\"\",IF(ROUNDDOWN(COUNTIF($C$12:C115,C115)/IF((A115-$A$12)<7,(A115+1-$A$12),(A115-$A$12)/7),0)>3,\"Poss Commute\",\"\"))","v":""},"",0,0,0,{"$nulls":7},0,0]
[{"$nulls":5},"",{"$f":"IF(OR(C116=\"home\",$X$10=1,C116=\"\"),\"\",IF(ROUNDDOWN(COUNTIF($C$12:C116,C116)/IF((A116-$A$12)<7,(A116+1-$A$12),(A116-$A$12)/7),0)>3,\"Poss Commute\",\"\"))","v":""},"",0,0,0,{"$nulls":7},0,0]
[{"$nulls":5},"",{"$f":"IF(OR(C117=\"home\",$X$10=1,C117=\"\"),\"\",IF(ROUNDDOWN(COUNTIF($C$12:C117,C117)/IF((A117-$A$12)<7,(A117+1-$A$12),(A117-$A$12)/7),0)>3,\"Poss Commute\",\"\"))","v":""},"",0,0,0,{"$nulls":7},0,0]
[{"$nulls":3},"Total Miles",{"$f":"IF(F119>3,SUM(E72:E117)-K118+Q118,\"Please fill in\")","v":"Please fill in"},null,null,{"$f":"COUNTIF(G72:G117,\"PR\")","v":0},{"$f":"SUM(I72:I117)","v":0},{"$f":"SUM(J72:J117)","v":0},{"$f":"SUM(K72:K117)","v":0},null,{"$f":"M117&M116&M115&M114&M113&M112&M111&M110&M109&M108&M107&M106&M105&M104&M103&M102&M101&M100&M99&M98&M97&M96&M95&M94&M93&M92&M91&M90&M89&M88&M87&M86&M85&M84&M83&M82&M81&M80&M79&M78&M77&M76&M75&M74&M73&M72","v":""},{"$nulls":3},{"$f":"SUM(Q72:Q117)+S118","v":0},{"$f":"COUNTA(R72:R117)","v":0},{"$f":"SUM(S72:S117)","v":0},{"$f":"SUM(T72:T117)","v":0}]
[{"$nulls":3},"Rate/Mile",{"$f":"IF(F119>3,IF(A72=0,new_rate,IF(A72<L67,old_rate,new_rate)),\"the yellow spaces\")","v":"the yellow spaces"},{"$f":"F59","v":1}]
[{"$nulls":3},"Total in $$",{"$f":"IF(F119>3,(E118*E119)+I118+J118,\"on summary page\")","v":"on summary page"}]
[{"$nulls":3},"Staff:",{"$f":"E61","v":" "}]
[null,null,"Abbreviations:","Dept/Project",{"$f":"E62","v":0}]
[null,null,"PD=Partnership Development","Month/Year (MM/DD/YY):"]
[null,null,"ICF=International Christian Fellowship","Vehicle/Work/Office Location:"]
[]
[{"$nulls":4},{"$f":"E66","v":""},{"$nulls":5},"old rate date","new rate date"]
[{"$nulls":3},{"$f":"IF(H178>0,\"PY=Prior Year Mileage Rate\",\"\")","v":""},{"$nulls":6},{"$f":"K128","v":{"v":43100,"d":"43,100"}},{"$f":"L128","v":{"v":43101,"d":"43,101"}}]
[{"$nulls":10},{"$f":"K68","v":"2017-12-31"},{"$f":"L68","v":"2018-01-01"}]
["Date","Destination (name & location)",null,"Ministry Purpose                 (see abbreviation box)","Total Miles",{"$nulls":5},{"$f":"K69","v":0.535},{"$f":"L69","v":0.545}]
[null,"From","To",{"$nulls":8},"office use only",{"$nulls":4},"amt  +/-","Esception",null,"for audit work"]
["(mm/dd/yy)","(example: Home or address)","(example: walmart on st. or address)",{"$nulls":5},"old adj","new adj",null,"initials","correction explanation"]
[{"$nulls":5},{"$f":"IF(A132>0,IF(submit_date>0,IF(submit_date-A132>60,\"disallow\",\"\"),IF(TODAY()-A132>60,\"disallow\",\"\")),\"\")","v":""},{"$f":"IF(OR(C132=\"home\",$X$10=1,C132=\"\"),\"\",IF(ROUNDDOWN(COUNTIF($C$12:C132,C132)/IF((A132-$A$12)<7,(A132+1-$A$12),(A132-$A$12)/7),0)>3,\"Poss Commute\",\"\"))","v":""},{"$f":"IF(A132=0,\"\",IF($A$12<new_rate_date,\"PR\",IF(A132<new_rate_date,\"PR\",\"\")))","v":""},{"$f":"IF($A$12<new_rate_date,0,IF(H132=\"PR\",(E132*old_rate)-(E132*new_rate),0))","v":0},{"$f":"IF($A$12<new_rate_date,IF(A132<new_rate_date,0,IF(H132=\"PR\",(E132*new_rate)-(E132*old_rate),0)),0)","v":0},{"$f":"IF(AND(F132=\"disallow\",R132=0),E132,0)","v":0},{"$nulls":7},{"$f":"IF(R132>0,-Q132,0)","v":0},{"$f":"IF(AND(A132<Fiscal_Start_Date,submit_date-A132<90,submit_date>=Fiscal_Start_Date),E132,0)","v":0}]
[{"$nulls":5},"",{"$f":"IF(OR(C133=\"home\",$X$10=1,C133=\"\"),\"\",IF(ROUNDDOWN(COUNTIF($C$12:C133,C133)/IF((A133-$A$12)<7,(A133+1-$A$12),(A133-$A$12)/7),0)>3,\"Poss Commute\",\"\"))","v":""},{"$f":"IF(A133=0,\"\",IF($A$12<new_rate_date,\"PR\",IF(A133<new_rate_date,\"PR\",\"\")))","v":""},{"$f":"IF($A$12<new_rate_date,0,IF(H133=\"PR\",(E133*old_rate)-(E133*new_rate),0))","v":0},{"$f":"IF($A$12<new_rate_date,IF(A133<new_rate_date,0,IF(H133=\"PR\",(E133*new_rate)-(E133*old_rate),0)),0)","v":0},{"$f":"IF(AND(F133=\"disallow\",R133=0),E133,0)","v":0},{"$nulls":7},{"$f":"IF(R133>0,-Q133,0)","v":0},0]
[{"$nulls":5},"",{"$f":"IF(OR(C134=\"home\",$X$10=1,C134=\"\"),\"\",IF(ROUNDDOWN(COUNTIF($C$12:C134,C134)/IF((A134-$A$12)<7,(A134+1-$A$12),(A134-$A$12)/7),0)>3,\"Poss Commute\",\"\"))","v":""},"",0,0,0,{"$nulls":7},{"$f":"IF(R134>0,-Q134,0)","v":0},0]
[{"$nulls":5},"",{"$f":"IF(OR(C135=\"home\",$X$10=1,C135=\"\"),\"\",IF(ROUNDDOWN(COUNTIF($C$12:C135,C135)/IF((A135-$A$12)<7,(A135+1-$A$12),(A135-$A$12)/7),0)>3,\"Poss Commute\",\"\"))","v":""},"",0,0,0,{"$nulls":7},0,0]
[{"$nulls":5},"",{"$f":"IF(OR(C136=\"home\",$X$10=1,C136=\"\"),\"\",IF(ROUNDDOWN(COUNTIF($C$12:C136,C136)/IF((A136-$A$12)<7,(A136+1-$A$12),(A136-$A$12)/7),0)>3,\"Poss Commute\",\"\"))","v":""},"",0,0,0,{"$nulls":7},0,0]
[{"$nulls":5},"",{"$f":"IF(OR(C137=\"home\",$X$10=1,C137=\"\"),\"\",IF(ROUNDDOWN(COUNTIF($C$12:C137,C137)/IF((A137-$A$12)<7,(A137+1-$A$12),(A137-$A$12)/7),0)>3,\"Poss Commute\",\"\"))","v":""},"",0,0,0,{"$nulls":7},0,0]
[{"$nulls":5},"",{"$f":"IF(OR(C138=\"home\",$X$10=1,C138=\"\"),\"\",IF(ROUNDDOWN(COUNTIF($C$12:C138,C138)/IF((A138-$A$12)<7,(A138+1-$A$12),(A138-$A$12)/7),0)>3,\"Poss Commute\",\"\"))","v":""},"",0,0,0,{"$nulls":7},0,0]
[{"$nulls":5},"",{"$f":"IF(OR(C139=\"home\",$X$10=1,C139=\"\"),\"\",IF(ROUNDDOWN(COUNTIF($C$12:C139,C139)/IF((A139-$A$12)<7,(A139+1-$A$12),(A139-$A$12)/7),0)>3,\"Poss Commute\",\"\"))","v":""},"",0,0,0,{"$nulls":7},0,0]
[{"$nulls":5},"",{"$f":"IF(OR(C140=\"home\",$X$10=1,C140=\"\"),\"\",IF(ROUNDDOWN(COUNTIF($C$12:C140,C140)/IF((A140-$A$12)<7,(A140+1-$A$12),(A140-$A$12)/7),0)>3,\"Poss Commute\",\"\"))","v":""},"",0,0,0,{"$nulls":7},0,0]
[{"$nulls":5},"",{"$f":"IF(OR(C141=\"home\",$X$10=1,C141=\"\"),\"\",IF(ROUNDDOWN(COUNTIF($C$12:C141,C141)/IF((A141-$A$12)<7,(A141+1-$A$12),(A141-$A$12)/7),0)>3,\"Poss Commute\",\"\"))","v":""},"",0,0,0,{"$nulls":7},0,0]
[{"$nulls":5},"",{"$f":"IF(OR(C142=\"home\",$X$10=1,C142=\"\"),\"\",IF(ROUNDDOWN(COUNTIF($C$12:C142,C142)/IF((A142-$A$12)<7,(A142+1-$A$12),(A142-$A$12)/7),0)>3,\"Poss Commute\",\"\"))","v":""},"",0,0,0,{"$nulls":7},0,0]
[{"$nulls":5},"",{"$f":"IF(OR(C143=\"home\",$X$10=1,C143=\"\"),\"\",IF(ROUNDDOWN(COUNTIF($C$12:C143,C143)/IF((A143-$A$12)<7,(A143+1-$A$12),(A143-$A$12)/7),0)>3,\"Poss Commute\",\"\"))","v":""},"",0,0,0,{"$nulls":7},0,0]
[{"$nulls":5},"",{"$f":"IF(OR(C144=\"home\",$X$10=1,C144=\"\"),\"\",IF(ROUNDDOWN(COUNTIF($C$12:C144,C144)/IF((A144-$A$12)<7,(A144+1-$A$12),(A144-$A$12)/7),0)>3,\"Poss Commute\",\"\"))","v":""},"",0,0,0,{"$nulls":7},0,0]
[{"$nulls":5},"",{"$f":"IF(OR(C145=\"home\",$X$10=1,C145=\"\"),\"\",IF(ROUNDDOWN(COUNTIF($C$12:C145,C145)/IF((A145-$A$12)<7,(A145+1-$A$12),(A145-$A$12)/7),0)>3,\"Poss Commute\",\"\"))","v":""},"",0,0,0,{"$nulls":7},0,0]
[{"$nulls":5},"",{"$f":"IF(OR(C146=\"home\",$X$10=1,C146=\"\"),\"\",IF(ROUNDDOWN(COUNTIF($C$12:C146,C146)/IF((A146-$A$12)<7,(A146+1-$A$12),(A146-$A$12)/7),0)>3,\"Poss Commute\",\"\"))","v":""},"",0,0,0,{"$nulls":7},0,0]
[{"$nulls":5},"",{"$f":"IF(OR(C147=\"home\",$X$10=1,C147=\"\"),\"\",IF(ROUNDDOWN(COUNTIF($C$12:C147,C147)/IF((A147-$A$12)<7,(A147+1-$A$12),(A147-$A$12)/7),0)>3,\"Poss Commute\",\"\"))","v":""},"",0,0,0,{"$nulls":7},0,0]
[{"$nulls":5},"",{"$f":"IF(OR(C148=\"home\",$X$10=1,C148=\"\"),\"\",IF(ROUNDDOWN(COUNTIF($C$12:C148,C148)/IF((A148-$A$12)<7,(A148+1-$A$12),(A148-$A$12)/7),0)>3,\"Poss Commute\",\"\"))","v":""},"",0,0,0,{"$nulls":7},0,0]
[{"$nulls":5},"",{"$f":"IF(OR(C149=\"home\",$X$10=1,C149=\"\"),\"\",IF(ROUNDDOWN(COUNTIF($C$12:C149,C149)/IF((A149-$A$12)<7,(A149+1-$A$12),(A149-$A$12)/7),0)>3,\"Poss Commute\",\"\"))","v":""},"",0,0,0,{"$nulls":7},0,0]
[{"$nulls":5},"",{"$f":"IF(OR(C150=\"home\",$X$10=1,C150=\"\"),\"\",IF(ROUNDDOWN(COUNTIF($C$12:C150,C150)/IF((A150-$A$12)<7,(A150+1-$A$12),(A150-$A$12)/7),0)>3,\"Poss Commute\",\"\"))","v":""},"",0,0,0,{"$nulls":7},0,0]
[{"$nulls":5},"",{"$f":"IF(OR(C151=\"home\",$X$10=1,C151=\"\"),\"\",IF(ROUNDDOWN(COUNTIF($C$12:C151,C151)/IF((A151-$A$12)<7,(A151+1-$A$12),(A151-$A$12)/7),0)>3,\"Poss Commute\",\"\"))","v":""},"",0,0,0,{"$nulls":7},0,0]
[{"$nulls":5},"",{"$f":"IF(OR(C152=\"home\",$X$10=1,C152=\"\"),\"\",IF(ROUNDDOWN(COUNTIF($C$12:C152,C152)/IF((A152-$A$12)<7,(A152+1-$A$12),(A152-$A$12)/7),0)>3,\"Poss Commute\",\"\"))","v":""},"",0,0,0,{"$nulls":7},0,0]
[{"$nulls":5},"",{"$f":"IF(OR(C153=\"home\",$X$10=1,C153=\"\"),\"\",IF(ROUNDDOWN(COUNTIF($C$12:C153,C153)/IF((A153-$A$12)<7,(A153+1-$A$12),(A153-$A$12)/7),0)>3,\"Poss Commute\",\"\"))","v":""},"",0,0,0,{"$nulls":7},0,0]
[{"$nulls":5},"",{"$f":"IF(OR(C154=\"home\",$X$10=1,C154=\"\"),\"\",IF(ROUNDDOWN(COUNTIF($C$12:C154,C154)/IF((A154-$A$12)<7,(A154+1-$A$12),(A154-$A$12)/7),0)>3,\"Poss Commute\",\"\"))","v":""},"",0,0,0,{"$nulls":7},0,0]
[{"$nulls":5},"",{"$f":"IF(OR(C155=\"home\",$X$10=1,C155=\"\"),\"\",IF(ROUNDDOWN(COUNTIF($C$12:C155,C155)/IF((A155-$A$12)<7,(A155+1-$A$12),(A155-$A$12)/7),0)>3,\"Poss Commute\",\"\"))","v":""},"",0,0,0,{"$nulls":7},0,0]
[{"$nulls":5},"",{"$f":"IF(OR(C156=\"home\",$X$10=1,C156=\"\"),\"\",IF(ROUNDDOWN(COUNTIF($C$12:C156,C156)/IF((A156-$A$12)<7,(A156+1-$A$12),(A156-$A$12)/7),0)>3,\"Poss Commute\",\"\"))","v":""},"",0,0,0,{"$nulls":7},0,0]
[{"$nulls":5},"",{"$f":"IF(OR(C157=\"home\",$X$10=1,C157=\"\"),\"\",IF(ROUNDDOWN(COUNTIF($C$12:C157,C157)/IF((A157-$A$12)<7,(A157+1-$A$12),(A157-$A$12)/7),0)>3,\"Poss Commute\",\"\"))","v":""},"",0,0,0,{"$nulls":7},0,0]
[{"$nulls":5},"",{"$f":"IF(OR(C158=\"home\",$X$10=1,C158=\"\"),\"\",IF(ROUNDDOWN(COUNTIF($C$12:C158,C158)/IF((A158-$A$12)<7,(A158+1-$A$12),(A158-$A$12)/7),0)>3,\"Poss Commute\",\"\"))","v":""},"",0,0,0,{"$nulls":7},0,0]
[{"$nulls":5},"",{"$f":"IF(OR(C159=\"home\",$X$10=1,C159=\"\"),\"\",IF(ROUNDDOWN(COUNTIF($C$12:C159,C159)/IF((A159-$A$12)<7,(A159+1-$A$12),(A159-$A$12)/7),0)>3,\"Poss Commute\",\"\"))","v":""},"",0,0,0,{"$nulls":7},0,0]
[{"$nulls":5},"",{"$f":"IF(OR(C160=\"home\",$X$10=1,C160=\"\"),\"\",IF(ROUNDDOWN(COUNTIF($C$12:C160,C160)/IF((A160-$A$12)<7,(A160+1-$A$12),(A160-$A$12)/7),0)>3,\"Poss Commute\",\"\"))","v":""},"",0,0,0,{"$nulls":7},0,0]
[{"$nulls":5},"",{"$f":"IF(OR(C161=\"home\",$X$10=1,C161=\"\"),\"\",IF(ROUNDDOWN(COUNTIF($C$12:C161,C161)/IF((A161-$A$12)<7,(A161+1-$A$12),(A161-$A$12)/7),0)>3,\"Poss Commute\",\"\"))","v":""},"",0,0,0,{"$nulls":7},0,0]
[{"$nulls":5},"",{"$f":"IF(OR(C162=\"home\",$X$10=1,C162=\"\"),\"\",IF(ROUNDDOWN(COUNTIF($C$12:C162,C162)/IF((A162-$A$12)<7,(A162+1-$A$12),(A162-$A$12)/7),0)>3,\"Poss Commute\",\"\"))","v":""},"",0,0,0,{"$nulls":7},0,0]
[{"$nulls":5},"",{"$f":"IF(OR(C163=\"home\",$X$10=1,C163=\"\"),\"\",IF(ROUNDDOWN(COUNTIF($C$12:C163,C163)/IF((A163-$A$12)<7,(A163+1-$A$12),(A163-$A$12)/7),0)>3,\"Poss Commute\",\"\"))","v":""},"",0,0,0,{"$nulls":7},0,0]
[{"$nulls":5},"",{"$f":"IF(OR(C164=\"home\",$X$10=1,C164=\"\"),\"\",IF(ROUNDDOWN(COUNTIF($C$12:C164,C164)/IF((A164-$A$12)<7,(A164+1-$A$12),(A164-$A$12)/7),0)>3,\"Poss Commute\",\"\"))","v":""},"",0,0,0,{"$nulls":7},0,0]
[{"$nulls":5},"",{"$f":"IF(OR(C165=\"home\",$X$10=1,C165=\"\"),\"\",IF(ROUNDDOWN(COUNTIF($C$12:C165,C165)/IF((A165-$A$12)<7,(A165+1-$A$12),(A165-$A$12)/7),0)>3,\"Poss Commute\",\"\"))","v":""},"",0,0,0,{"$nulls":7},0,0]
[{"$nulls":5},"",{"$f":"IF(OR(C166=\"home\",$X$10=1,C166=\"\"),\"\",IF(ROUNDDOWN(COUNTIF($C$12:C166,C166)/IF((A166-$A$12)<7,(A166+1-$A$12),(A166-$A$12)/7),0)>3,\"Poss Commute\",\"\"))","v":""},"",0,0,0,{"$nulls":7},0,0]
[{"$nulls":5},"",{"$f":"IF(OR(C167=\"home\",$X$10=1,C167=\"\"),\"\",IF(ROUNDDOWN(COUNTIF($C$12:C167,C167)/IF((A167-$A$12)<7,(A167+1-$A$12),(A167-$A$12)/7),0)>3,\"Poss Commute\",\"\"))","v":""},"",0,0,0,{"$nulls":7},0,0]
[{"$nulls":5},"",{"$f":"IF(OR(C168=\"home\",$X$10=1,C168=\"\"),\"\",IF(ROUNDDOWN(COUNTIF($C$12:C168,C168)/IF((A168-$A$12)<7,(A168+1-$A$12),(A168-$A$12)/7),0)>3,\"Poss Commute\",\"\"))","v":""},"",0,0,0,{"$nulls":7},0,0]
[{"$nulls":5},"",{"$f":"IF(OR(C169=\"home\",$X$10=1,C169=\"\"),\"\",IF(ROUNDDOWN(COUNTIF($C$12:C169,C169)/IF((A169-$A$12)<7,(A169+1-$A$12),(A169-$A$12)/7),0)>3,\"Poss Commute\",\"\"))","v":""},"",0,0,0,{"$nulls":7},0,0]
[{"$nulls":5},"",{"$f":"IF(OR(C170=\"home\",$X$10=1,C170=\"\"),\"\",IF(ROUNDDOWN(COUNTIF($C$12:C170,C170)/IF((A170-$A$12)<7,(A170+1-$A$12),(A170-$A$12)/7),0)>3,\"Poss Commute\",\"\"))","v":""},"",0,0,0,{"$nulls":7},0,0]
[{"$nulls":5},"",{"$f":"IF(OR(C171=\"home\",$X$10=1,C171=\"\"),\"\",IF(ROUNDDOWN(COUNTIF($C$12:C171,C171)/IF((A171-$A$12)<7,(A171+1-$A$12),(A171-$A$12)/7),0)>3,\"Poss Commute\",\"\"))","v":""},"",0,0,0,{"$nulls":7},0,0]
[{"$nulls":5},"",{"$f":"IF(OR(C172=\"home\",$X$10=1,C172=\"\"),\"\",IF(ROUNDDOWN(COUNTIF($C$12:C172,C172)/IF((A172-$A$12)<7,(A172+1-$A$12),(A172-$A$12)/7),0)>3,\"Poss Commute\",\"\"))","v":""},"",0,0,0,{"$nulls":7},0,0]
[{"$nulls":5},"",{"$f":"IF(OR(C173=\"home\",$X$10=1,C173=\"\"),\"\",IF(ROUNDDOWN(COUNTIF($C$12:C173,C173)/IF((A173-$A$12)<7,(A173+1-$A$12),(A173-$A$12)/7),0)>3,\"Poss Commute\",\"\"))","v":""},"",0,0,0,{"$nulls":7},0,0]
[{"$nulls":5},"",{"$f":"IF(OR(C174=\"home\",$X$10=1,C174=\"\"),\"\",IF(ROUNDDOWN(COUNTIF($C$12:C174,C174)/IF((A174-$A$12)<7,(A174+1-$A$12),(A174-$A$12)/7),0)>3,\"Poss Commute\",\"\"))","v":""},"",0,0,0,{"$nulls":7},0,0]
[{"$nulls":5},"",{"$f":"IF(OR(C175=\"home\",$X$10=1,C175=\"\"),\"\",IF(ROUNDDOWN(COUNTIF($C$12:C175,C175)/IF((A175-$A$12)<7,(A175+1-$A$12),(A175-$A$12)/7),0)>3,\"Poss Commute\",\"\"))","v":""},"",0,0,0,{"$nulls":7},0,0]
[{"$nulls":5},"",{"$f":"IF(OR(C176=\"home\",$X$10=1,C176=\"\"),\"\",IF(ROUNDDOWN(COUNTIF($C$12:C176,C176)/IF((A176-$A$12)<7,(A176+1-$A$12),(A176-$A$12)/7),0)>3,\"Poss Commute\",\"\"))","v":""},"",0,0,0,{"$nulls":7},0,0]
[{"$nulls":5},"",{"$f":"IF(OR(C177=\"home\",$X$10=1,C177=\"\"),\"\",IF(ROUNDDOWN(COUNTIF($C$12:C177,C177)/IF((A177-$A$12)<7,(A177+1-$A$12),(A177-$A$12)/7),0)>3,\"Poss Commute\",\"\"))","v":""},"",0,0,0,{"$nulls":7},0,0]
[{"$nulls":3},"Total Miles",{"$f":"IF(F179>3,SUM(E132:E177)-K178+Q178,\"Please fill in\")","v":"Please fill in"},null,null,{"$f":"COUNTIF(G132:G177,\"PR\")","v":0},{"$f":"SUM(I132:I177)","v":0},{"$f":"SUM(J132:J177)","v":0},{"$f":"SUM(K132:K177)","v":0},null,{"$f":"M177&M176&M175&M174&M173&M172&M171&M170&M169&M168&M167&M166&M165&M164&M163&M162&M161&M160&M159&M158&M157&M156&M155&M154&M153&M152&M151&M150&M149&M148&M147&M146&M145&M144&M143&M142&M141&M140&M139&M138&M137&M136&M135&M134&M133&M132","v":""},{"$nulls":3},{"$f":"SUM(Q132:Q177)+S178","v":0},{"$f":"COUNTA(R132:R177)","v":0},{"$f":"SUM(S132:S177)","v":0},{"$f":"SUM(T132:T177)","v":0}]
[{"$nulls":3},"Rate/Mile",{"$f":"IF(F179>3,IF(A132=0,new_rate,IF(A132<L127,old_rate,new_rate)),\"the yellow spaces\")","v":"the yellow spaces"},{"$f":"F119","v":1},{"$nulls":13},{"$f":"(T178+T118+T58)*new_rate","v":0}]
[{"$nulls":3},"Total in $$",{"$f":"IF(F179>3,(E178*E179)+I178+J178,\"on summary page\")","v":"on summary page"},{"$nulls":12},{"$f":"R178+R118+R58","v":0}]

{"sheet":"Donor","index":6,"n_rows":48,"n_cols":25,"rows_kept":48,"merged":[[5,6,5,8],[5,9,5,11],[6,6,6,8],[6,9,6,11],[7,6,7,8],[7,9,7,11],[8,6,8,8],[8,9,8,11],[9,6,9,8],[9,9,9,11],[10,6,10,8],[10,9,10,11],[12,1,12,3],[12,7,12,10],[12,15,12,19],[12,20,13,20],[12,21,13,21],[12,22,13,22],[12,24,13,24],[13,1,13,3],[13,4,13,6],[13,7,13,10],[13,16,13,19],[14,1,14,3],[14,4,14,6],[14,7,14,10],[15,1,15,3],[15,4,15,6],[15,7,15,10],[15,16,15,19],[16,1,16,3],[16,4,16,6],[16,7,16,10],[16,16,16,19],[17,1,17,3],[17,4,17,6],[17,7,17,10],[17,16,17,19],[18,1,18,3],[18,4,18,6],[18,7,18,10],[18,16,18,19],[19,1,19,3],[19,4,19,6],[19,7,19,10],[19,16,19,19],[20,1,20,3],[20,4,20,6],[20,7,20,10],[20,16,20,19],[21,1,21,3],[21,4,21,6],[21,7,21,10],[21,16,21,19],[22,1,22,3],[22,4,22,6],[22,7,22,10],[22,16,22,19],[23,1,23,3],[23,4,23,6],[23,7,23,10],[23,16,23,19],[24,1,24,3],[24,4,24,6],[24,7,24,10],[24,16,24,19],[25,1,25,3],[25,4,25,6],[25,7,25,10],[25,16,25,19],[26,1,26,3],[26,4,26,6],[26,7,26,10],[26,16,26,19],[27,1,27,3],[27,4,27,6],[27,7,27,10],[27,16,27,19],[28,1,28,3],[28,4,28,6],[28,7,28,10],[28,16,28,19],[29,1,29,3],[29,4,29,6],[29,7,29,10],[29,16,29,19],[30,1,30,3],[30,4,30,6],[30,7,30,10],[30,16,30,19],[31,1,31,3],[31,4,31,6],[31,7,31,10],[31,16,31,19],[32,1,32,3],[32,4,32,6],[32,7,32,10],[32,16,32,19],[33,1,33,3],[33,4,33,6],[33,7,33,10],[33,16,33,19],[34,1,34,3],[34,4,34,6],[34,7,34,10],[34,16,34,19],[35,1,35,3],[35,4,35,6],[35,7,35,10],[35,16,35,19],[36,1,36,3],[36,4,36,6],[36,7,36,10],[36,16,36,19],[37,1,37,3],[37,4,37,6],[37,7,37,10],[37,16,37,19],[38,1,38,3],[38,4,38,6],[38,7,38,10],[38,16,38,19],[39,1,39,3],[39,4,39,6],[39,7,39,10],[39,16,39,19],[40,1,40,3],[40,4,40,6],[40,7,40,10],[40,16,40,19],[41,1,41,3],[41,4,41,6],[41,7,41,10],[41,16,41,19],[42,1,42,3],[42,4,42,6],[42,7,42,10],[42,16,42,19],[43,16,43,19],[44,0,47,7]]}
["EXAMPLES",{"$nulls":8},"Name",{"$f":"'Mileage log'!E1","v":" "}]
[null,"Prayer letters",{"$nulls":3},"Entertaining donors, etc.",{"$nulls":3},"Dept/Project",{"$f":"'Mileage log'!E2","v":0}]
[null,"Newsletters",{"$nulls":3},"Presentations for donors, etc."]
[null,"Meals with donors & potential donors",{"$nulls":3},"Gifts - limited to $100 per family"]
[]
[{"$nulls":6},"Abbreviations:"]
["*ORIGINAL Receipts  required if $75.00 or greater",{"$nulls":5},"PD=Partnership Development"]
["   List complete information below for all expenses.",{"$nulls":5},"ICF=International Christian Fellowship"]
[]
["** Expense must be submitted with"]
["    in 60 days of being incurred."]
[]
["Date","Name of Donor",{"$nulls":5},"Location",{"$nulls":7},"office use only",{"$nulls":4},"amt  +/-","disallow","exception",null,"for audit work"]
["(mm/dd/yy)","and Type of Item",null,null,"Ministry purpose",null,null,"(Company/Restaurant and City and State)",{"$nulls":3},"Amount",{"$nulls":3},"initials","correction explanation"]
[{"$nulls":12},{"$f":"IF(L15>=75,\"*\",\" \")","v":" "},null,{"$f":"IF(L15>=75,L15,\" \")","v":" "}]
[{"$nulls":12},{"$f":"IF(A16>0,IF(submit_date>0,IF(submit_date-A16>60,\"disallow\",IF(L16>=75,IF(AND(N16=\"\",TODAY()-submit_date>30),\"disallow\",\"*\"),\" \")),IF(TODAY()-A16>60,\"disallow\",IF(L16>=75,IF(AND(N16=\"\",TODAY()-submit_date>30),\"disallow\",\"*\"),\" \"))),IF(L16>=75,IF(AND(N16=\"\",TODAY()-submit_date>30),\"disallow\",\"*\"),\"\"))","v":""},null,{"$f":"IF(AND(L16>=75,M16<>\"disallow\"),1,\" \")","v":" "},{"$nulls":6},{"$f":"IF(AND(M16=\"disallow\",W16=0),L16,0)","v":0},null,{"$f":"IF(AND(U16<>0,W16>0),-U16,0)","v":0},{"$f":"IF(AND(A16<Fiscal_Start_Date,submit_date-A16<90),L16,0)","v":0}]
[{"$nulls":12},"",null,{"$f":"IF(AND(L17>=75,M17<>\"disallow\"),1,\" \")","v":" "},{"$nulls":5},0,0,null,0,0]
[{"$nulls":12},"",null," ",{"$nulls":5},0,0,null,0,0]
[{"$nulls":12},"",null," ",{"$nulls":5},0,0,null,0,0]
[{"$nulls":12},"",null," ",{"$nulls":5},0,0,null,0,0]
[{"$nulls":12},"",null," ",{"$nulls":5},0,0,null,0,0]
[{"$nulls":12},"",null," ",{"$nulls":5},0,0,null,0,0]
[{"$nulls":12},"",null," ",{"$nulls":5},0,0,null,0,0]
[{"$nulls":12},"",null," ",{"$nulls":5},0,0,null,0,0]
[{"$nulls":12},"",null," ",{"$nulls":5},0,0,null,0,0]
[{"$nulls":12},"",null," ",{"$nulls":5},0,0,null,0,0]
[{"$nulls":12},"",null," ",{"$nulls":5},0,0,null,0,0]
[{"$nulls":12},"",null," ",{"$nulls":5},0,0,null,0,0]
[{"$nulls":12},"",null," ",{"$nulls":5},0,0,null,0,0]
[{"$nulls":12},"",null," ",{"$nulls":5},0,0,null,0,0]
[{"$nulls":12},"",null," ",{"$nulls":5},0,0,null,0,0]
[{"$nulls":12},"",null," ",{"$nulls":5},0,0,null,0,0]
[{"$nulls":12},"",null," ",{"$nulls":5},0,0,null,0,0]
[{"$nulls":12},"",null," ",{"$nulls":5},0,0,null,0,0]
[{"$nulls":12},"",null," ",{"$nulls":5},0,0,null,0,0]
[{"$nulls":12},"",null," ",{"$nulls":5},0,0,null,0,0]
[{"$nulls":12},"",null," ",{"$nulls":5},0,0,null,0,0]
[{"$nulls":12},"",null," ",{"$nulls":5},0,0,null,0,0]
[{"$nulls":12},"",null," ",{"$nulls":5},0,0,null,0,0]
[{"$nulls":12},"",null," ",{"$nulls":5},0,0,null,0,0]
[{"$nulls":12},"",null," ",{"$nulls":5},0,0,null,0,0]
[{"$nulls":12},"",null," ",{"$nulls":5},0,0,null,0,0]
[{"$nulls":12},"",null," ",{"$nulls":5},0,0,null,0,0]
[{"$nulls":10},"Sub-Total",{"$f":"IF(M47>3,SUM(L15:L43)-V44,\"Please fill in\")","v":"Please fill in"},null,{"$f":"COUNTIF(N16:N43,\"x\")","v":0},null,null,{"$f":"SUM(Q16:T43)","v":0},{"$nulls":3},{"$f":"SUM(U16:U43)+X44","v":0},{"$f":"SUM(V16:V43)","v":0},{"$f":"COUNTA(W16:W43)","v":0},{"$f":"SUM(X16:X43)","v":0},{"$f":"SUM(Y16:Y43)","v":0}]
[{"$f":"IF(L46>0,\"DON’T FORGET TO ATTACH YOUR RECEIPT DOCUMENTATION TO THE EMAIL\",\"\")","v":""},{"$nulls":9},"Meals Sheet Total",{"$f":"IF(M47>3,'Meals-Donor'!D47,\"the yellow\")","v":"the yellow"}]
[{"$nulls":10},"Total of Receipts to be Mailed",{"$f":"IF(FundCode<>500,COUNT(L15:L39),IF(M47>3,SUM(O15:O43),\"spaces on\"))","v":0}]
[{"$nulls":11},{"$f":"IF(L44=\"please fill in\",\"spaces on\",\"\")","v":"spaces on"},{"$f":"Summary!O12","v":{"v":1,"d":"1.00"}}]
[{"$nulls":10},"Donor Grand Total",{"$f":"IF(M47>3,L44+L45+U44,\"summary page\")","v":"summary page"}]

{"sheet":"Meals-Donor","index":7,"n_rows":47,"n_cols":24,"rows_kept":47,"merged":[[0,0,0,1],[0,2,0,3],[1,0,1,1],[1,2,1,3],[2,0,2,1],[2,2,2,3],[3,0,3,1],[3,2,3,3],[4,0,4,1],[4,2,4,3],[5,0,5,1],[5,2,5,3],[9,8,9,12],[10,1,10,3],[10,4,11,4],[10,5,11,5],[10,8,10,11],[10,16,10,19],[10,20,11,20],[10,21,10,23],[11,13,11,15],[12,11,12,12],[13,11,13,12],[14,11,14,12],[15,11,15,12],[16,11,16,12],[17,11,17,12],[18,11,18,12],[19,11,19,12],[20,11,20,12],[21,11,21,12],[22,11,22,12],[23,11,23,12],[24,11,24,12],[25,11,25,12],[26,11,26,12],[27,11,27,12],[28,11,28,12],[29,11,29,12],[30,11,30,12],[31,11,31,12],[32,11,32,12],[33,11,33,12],[34,11,34,12],[35,11,35,12],[36,11,36,12],[37,11,37,12],[38,11,38,12],[39,11,39,12],[40,11,40,12],[41,11,41,12],[42,11,42,12]]}
["Abbreviations:",{"$nulls":4},"Monthly Meals Sheet-Donors"]
["PD=Partnership Development",{"$nulls":4},"For meals provided in your home. "]
["ICF=Int'l Christian Fellowship",{"$nulls":4},"No grocery receipts are required."]
[]
[{"$nulls":4},"Staff: ",{"$f":"Donor!K1","v":" "}]
[]
[{"$nulls":4},"Dept/Project",{"$f":"Donor!K2","v":0}]
[]
["The meal sheet should not be used for planned events, but rather for drop by visits"]
[{"$nulls":8},"Office Use only"]
["Date","Number of Guest at Meal:",null,null,"Ministry purpose","Student/Volunteers                             (no hosts)                                       (use as multiple lines if needed)",null,null,"Correctiion",{"$nulls":7},"Exception",{"$nulls":3},"for audit work","limit on reimb level"]
["(mm/dd/yy)","Breakfast","Lunch","Supper",{"$nulls":3},"Initials","break","lunch","dinner","reason for adjustment",null,"disallowed",null,null,"initials","break","lunch","dinner",null,"break","lunch","dinner"]
[{"$nulls":6},{"$f":"IF(A13>0,IF(submit_date>0,IF(submit_date-A13>60,\"disallow\",\" \"),IF(TODAY()-A13>60,\"disallow\",\" \")),\"\")","v":""},{"$nulls":4}," ",null,{"$f":"IF(AND($G13=\"disallow\",Q$13=0),B13,0)","v":0},{"$f":"IF(AND($G13=\"disallow\",Q$13=0),C13,0)","v":0},{"$f":"IF(AND($G13=\"disallow\",Q$13=0),D13,0)","v":0},null,{"$f":"IF($Q13>0,I13,0)","v":0},{"$f":"IF($Q13>0,J13,0)","v":0},{"$f":"IF($Q13>0,K13,0)","v":0},{"$f":"IF(AND(A13<Fiscal_Start_Date,submit_date-A13<90,submit_date>=Fiscal_Start_Date),B13*$B$45+C13*$C$45+D13*$D$45,0)","v":0},{"$f":"IF($B13>7,$B13-7,0)","v":0},{"$f":"IF($C13>7,$C13-7,0)","v":0},{"$f":"IF($D13>7,$D13-7,0)","v":0}]
[{"$nulls":6},"",{"$nulls":4}," ",null,{"$f":"IF(AND($G14=\"disallow\",Q$13=0),B14,0)","v":0},{"$f":"IF(AND($G14=\"disallow\",Q$13=0),C14,0)","v":0},{"$f":"IF(AND($G14=\"disallow\",Q$13=0),D14,0)","v":0},null,{"$f":"IF($Q14>0,I14,0)","v":0},{"$f":"IF($Q14>0,J14,0)","v":0},{"$f":"IF($Q14>0,K14,0)","v":0},0,{"$f":"IF($B14>7,$B14-7,0)","v":0},{"$f":"IF($C14>7,$C14-7,0)","v":0},{"$f":"IF($D14>7,$D14-7,0)","v":0}]
[{"$nulls":6},"",{"$nulls":4}," ",null,0,0,0,null,0,0,0,0,0,0,0]
[{"$nulls":6},"",{"$nulls":4}," ",null,0,0,0,null,0,0,0,0,0,0,0]
[{"$nulls":6},"",{"$nulls":4}," ",null,0,0,0,null,0,0,0,0,0,0,0]
[{"$nulls":6},"",{"$nulls":4}," ",null,0,0,0,null,0,0,0,0,0,0,0]
[{"$nulls":6},"",{"$nulls":4}," ",null,0,0,0,null,0,0,0,0,0,0,0]
[{"$nulls":6},"",{"$nulls":4}," ",null,0,0,0,null,0,0,0,0,0,0,0]
[{"$nulls":6},"",{"$nulls":4}," ",null,{"$f":"IF(AND($G21=\"disallow\",Q$13=0),B21,0)","v":0},{"$f":"IF(AND($G21=\"disallow\",Q$13=0),C21,0)","v":0},{"$f":"IF(AND($G21=\"disallow\",Q$13=0),D21,0)","v":0},null,{"$f":"IF($Q21>0,I21+N21,0)","v":0},{"$f":"IF($Q21>0,J21+O21,0)","v":0},{"$f":"IF($Q21>0,K21+P21,0)","v":0},0,0,0,0]
[{"$nulls":6},"",{"$nulls":4},"  ",null,0,0,0,null,0,0,0,0,0,0,0]
[{"$nulls":6},"",{"$nulls":4}," ",null,0,0,0,null,0,0,0,0,0,0,0]
[{"$nulls":6},"",{"$nulls":4}," ",null,0,0,0,null,0,0,0,0,0,0,0]
[{"$nulls":6},"",{"$nulls":4}," ",null,0,0,0,null,0,0,0,0,0,0,0]
[{"$nulls":6},"",{"$nulls":4}," ",null,0,0,0,null,0,0,0,0,0,0,0]
[{"$nulls":6},"",{"$nulls":4}," ",null,0,0,0,null,0,0,0,0,0,0,0]
[{"$nulls":6},"",{"$nulls":4}," ",null,0,0,0,null,0,0,0,0,0,0,0]
[{"$nulls":6},"",{"$nulls":4}," ",null,0,0,0,null,0,0,0,0,0,0,0]
[{"$nulls":6},"",{"$nulls":4}," ",null,0,0,0,null,0,0,0,0,0,0,0]
[{"$nulls":6},"",{"$nulls":4}," ",null,0,0,0,null,0,0,0,0,0,0,0]
[{"$nulls":6},"",{"$nulls":4},"  ",null,0,0,0,null,0,0,0,0,0,0,0]
[{"$nulls":6},"",{"$nulls":4}," ",null,0,0,0,null,0,0,0,0,0,0,0]
[{"$nulls":6},"",{"$nulls":4}," ",null,0,0,0,null,0,0,0,0,0,0,0]
[{"$nulls":6},"",{"$nulls":4}," ",null,0,0,0,null,0,0,0,0,0,0,0]
[{"$nulls":6},"",{"$nulls":4}," ",null,0,0,0,null,0,0,0,0,0,0,0]
[{"$nulls":6},"",{"$nulls":4}," ",null,0,0,0,null,0,0,0,0,0,0,0]
[{"$nulls":6},"",{"$nulls":4}," ",null,0,0,0,null,0,0,0,0,0,0,0]
[{"$nulls":6},"",{"$nulls":4}," ",null,0,0,0,null,0,0,0,0,0,0,0]
[{"$nulls":6},"",{"$nulls":4}," ",null,0,0,0,null,0,0,0,0,0,0,0]
[{"$nulls":6},"",{"$nulls":4}," ",null,0,0,0,null,0,0,0,0,0,0,0]
[{"$nulls":6},"",{"$nulls":4}," ",null,0,0,0,null,0,0,0,0,0,0,0]
[{"$nulls":6},"",{"$nulls":4}," ",null,0,0,0,null,0,0,0,0,0,0,0]
["Subtotal",{"$f":"SUM(B13:B43)-N44+I44-V44","v":0},{"$f":"SUM(C13:C43)-O44+J44-W44","v":0},{"$f":"SUM(D13:D43)-P44+K44-X44","v":0},{"$nulls":4},{"$f":"-SUM(I13:I43)+R44","v":0},{"$f":"-SUM(J13:J43)+S44","v":0},{"$f":"-SUM(K13:K43)+T44","v":0},{"$f":"L13&L14&L15&L16&L17&L18&L19&L20&L21&L22&L23&L24&L25&L26&L27&L28&L29&L30&L31&L32&L33&L34&L35&L36&L37&L38&L39&L40&L41&L42&L43","v":"                                 "},null,{"$f":"SUM(N13:N43)","v":0},{"$f":"SUM(O13:O43)","v":0},{"$f":"SUM(P13:P43)","v":0},{"$f":"COUNTA(Q13:Q43)","v":0},{"$f":"SUM(R13:R43)","v":0},0,0,0,0,0,0]
["x Rate",4,7,10]
["Totl",{"$f":"IF(E47>3,B44*B45,\"Please Fill\")","v":"Please Fill"},{"$f":"IF(E47>3,C44*C45,\"in the \")","v":"in the "},{"$f":"IF(E47>3,D44*D45,\"yellow spaces\")","v":"yellow spaces"}]
[{"$nulls":3},{"$f":"IF(E47>3,SUM(B46:D46),\"on summary page\")","v":"on summary page"},{"$f":"Summary!O12","v":{"v":1,"d":"1.00"}},"TOTAL"]

{"sheet":"Office Expense","index":8,"n_rows":44,"n_cols":28,"rows_kept":44,"merged":[[6,6,6,8],[6,9,6,11],[7,6,7,8],[7,9,7,11],[8,6,8,8],[8,9,8,11],[9,6,9,8],[9,9,9,11],[10,6,10,8],[10,9,10,11],[11,6,11,8],[11,9,11,11],[12,1,12,3],[12,7,12,10],[12,15,12,19],[12,20,13,20],[12,21,13,21],[12,22,13,22],[12,24,13,24],[13,1,13,3],[13,4,13,6],[13,7,13,10],[13,16,13,19],[14,1,14,3],[14,4,14,6],[14,7,14,10],[15,1,15,3],[15,4,15,6],[15,7,15,10],[15,16,15,19],[16,1,16,3],[16,4,16,6],[16,7,16,10],[16,16,16,19],[17,1,17,3],[17,4,17,6],[17,7,17,10],[17,16,17,19],[18,1,18,3],[18,4,18,6],[18,7,18,10],[18,16,18,19],[19,1,19,3],[19,4,19,6],[19,7,19,10],[19,16,19,19],[20,1,20,3],[20,4,20,6],[20,7,20,10],[20,16,20,19],[21,1,21,3],[21,4,21,6],[21,7,21,10],[21,16,21,19],[22,1,22,3],[22,4,22,6],[22,7,22,10],[22,16,22,19],[23,1,23,3],[23,4,23,6],[23,7,23,10],[23,16,23,19],[24,1,24,3],[24,4,24,6],[24,7,24,10],[24,16,24,19],[25,1,25,3],[25,4,25,6],[25,7,25,10],[25,16,25,19],[26,1,26,3],[26,4,26,6],[26,7,26,10],[26,16,26,19],[27,1,27,3],[27,4,27,6],[27,7,27,10],[27,16,27,19],[28,1,28,3],[28,4,28,6],[28,7,28,10],[28,16,28,19],[29,1,29,3],[29,4,29,6],[29,7,29,10],[29,16,29,19],[30,1,30,3],[30,4,30,6],[30,7,30,10],[30,16,30,19],[31,1,31,3],[31,4,31,6],[31,7,31,10],[31,16,31,19],[32,1,32,3],[32,4,32,6],[32,7,32,10],[32,16,32,19],[33,1,33,3],[33,4,33,6],[33,7,33,10],[33,16,33,19],[34,1,34,3],[34,4,34,6],[34,7,34,10],[34,16,34,19],[35,1,35,3],[35,4,35,6],[35,7,35,10],[35,16,35,19],[36,1,36,3],[36,4,36,6],[36,7,36,10],[36,16,36,19],[37,1,37,3],[37,4,37,6],[37,7,37,10],[37,16,37,19],[38,1,38,3],[38,4,38,6],[38,7,38,10],[38,16,38,19],[39,1,39,3],[39,4,39,6],[39,7,39,10],[39,16,39,19],[40,16,40,19],[41,0,44,7]]}
["EXAMPLES",{"$nulls":8},"Name",{"$f":"'Meals-Donor'!F5","v":" "}]
[null,"Office Rent",{"$nulls":3},"Printer Paper",{"$nulls":3},"Dept/Project",{"$f":"Donor!K2","v":0}]
[null,"Telephone",{"$nulls":3},"Printer Cartridges/Ribbons"]
[null,"Pens, Pencils, Staples, Post-it notes, etc.",{"$nulls":3},"Postage",{"$nulls":3},{"$f":"IF(SUM(Z16:Z40)>0,_xlfn.IFNA(VLOOKUP(K2,AA8:AB32,2,),\"\"),\"\")","v":""}]
[null,"Ministry Consumables (i.e Bibles)",{"$nulls":3},"Email/Internet Fees"]
[]
["*ORIGINAL Receipts  required if $75.00 or greater",{"$nulls":5},"Abbreviations:"]
["   List complete information below for all expenses.",{"$nulls":5},"PD=Partnership Development",{"$nulls":19},5783,"Pam cell/ Derrah hotspot/ipod"]
[{"$nulls":6},"ICF=International Christian Fellowship",{"$nulls":19},5440,"Cell verified 2014"]
["**Expense must be submitted with",{"$nulls":25},5345,"Cell verified 2016"]
["   in 60 days of being incurred.",{"$nulls":25},5527,"Cell verified 2014"]
[{"$nulls":26},5701,"Cell verified 2014"]
["Date","Name of Person",{"$nulls":5},"Location",{"$nulls":7},"office use only",{"$nulls":4},"amt  +/-","disallow","exception",null,"for audit work",null,5336,"Cell verified 2014"]
["(mm/dd/yy)","and Type of Item",null,null,"Ministry purpose",null,null,"(Company/Store and City and State)",{"$nulls":3},"Amount",{"$nulls":3},"initials","correction explanation",{"$nulls":9},5221,"Cell verified 2014"]
[{"$nulls":12},{"$f":"IF(L15>=75,\"*\",\" \")","v":" "},null,{"$f":"IF(L15>=75,L15,\" \")","v":" "},{"$nulls":12},"Cell verified 2014"]
[{"$nulls":12},{"$f":"IF(A16>0,IF(submit_date>0,IF(submit_date-A16>60,\"disallow\",IF(L16>=75,IF(AND(N16=\"\",TODAY()-submit_date>30),\"disallow\",\"*\"),\" \")),IF(TODAY()-A16>60,\"disallow\",IF(L16>=75,IF(AND(N16=\"\",TODAY()-submit_date>30),\"disallow\",\"*\"),\" \"))),IF(L16>=75,IF(AND(N16=\"\",TODAY()-submit_date>30),\"disallow\",\"*\"),\"\"))","v":""},null,{"$f":"IF(L16>=75,1,0)","v":0},{"$nulls":6},{"$f":"IF(AND(M16=\"disallow\",W16=0),L16,0)","v":0},null,{"$f":"IF(AND(U16<>0,W16>0),-U16,0)","v":0},{"$f":"IF(AND(A16<Fiscal_Start_Date,submit_date-A16<90),L16,0)","v":0},{"$f":"IFERROR(SEARCH(\"cell\",B16,1),0)+IFERROR(SEARCH(\"phone\",E16,1),0)+IFERROR(SEARCH(\"internet\",E16,1),0)+IFERROR(SEARCH(\"cell\",E16,1),0)+IFERROR(SEARCH(\"phone\",B16,1),0)+IFERROR(SEARCH(\"internet\",B16,1),0)","v":0},5794,"Ruth Cell=30, Internet (ITV not TV)"]
[{"$nulls":12},"",null,{"$f":"IF(L17>=75,1,0)","v":0},{"$nulls":5},0,{"$f":"IF(AND(M17=\"disallow\",W17=0),L17,0)","v":0},null,{"$f":"IF(AND(U17>0,W17>0),U17,0)","v":0},0,{"$f":"IFERROR(SEARCH(\"cell\",B17,1),0)+IFERROR(SEARCH(\"phone\",E17,1),0)+IFERROR(SEARCH(\"internet\",E17,1),0)+IFERROR(SEARCH(\"cell\",E17,1),0)+IFERROR(SEARCH(\"phone\",B17,1),0)+IFERROR(SEARCH(\"internet\",B17,1),0)","v":0},5453,"Cell verified 2014"]
[{"$nulls":12},"",null,0,{"$nulls":5},0,0,null,0,0,0,5482,"ATT=25%, Wife cell, IPOD, Time Warner - $10"]
[{"$nulls":12},"",null,0,{"$nulls":5},0,0,null,0,0,0,5214,"Cell verified 2015"]
[{"$nulls":12},"",null,0,{"$nulls":5},0,0,null,0,0,0,5533,"Cell verified 2015"]
[{"$nulls":12},"",null,0,{"$nulls":5},0,0,null,0,0,0,5342,"Cell verified 2015"]
[{"$nulls":12},"",null,0,{"$nulls":5},0,0,null,0,0,0,5686,"Cell verified 2015"]
[{"$nulls":12},"",null,0,{"$nulls":5},0,0,null,0,0,0,5594,"Cell verified 2015 50%"]
[{"$nulls":12},"",null,0,{"$nulls":5},0,0,null,0,0,0,5139,"Business Phone 50%"]
[{"$nulls":12},"",null,0,{"$nulls":5},0,0,null,0,0,0,5449,"Cell verified 2015"]
[{"$nulls":12},"",null,0,{"$nulls":5},0,0,null,0,0,0,5442,"Cell verified 2015"]
[{"$nulls":12},"",null,0,{"$nulls":5},0,0,null,0,0,0,5647,"Cell verified 2015"]
[{"$nulls":12},"",null,0,{"$nulls":5},0,0,null,0,0,0,5260,"Cell verified 2015"]
[{"$nulls":12},"",null,0,{"$nulls":5},0,0,null,0,0,0,5391,"Verified 2015 not bundled"]
[{"$nulls":12},"",null,0,{"$nulls":5},0,0,null,0,0,0,5563,"Phone verified 2015"]
[{"$nulls":12},"",null,0,{"$nulls":5},0,0,null,0,0,0,5428,"Cell verified 2015 no home phone"]
[{"$nulls":12},"",null,0,{"$nulls":5},0,0,null,0,0,0,5884,"Landline not allowed - personal"]
[{"$nulls":12},"",null,0,{"$nulls":5},0,0,null,0,0,0]
[{"$nulls":12},"",null,0,{"$nulls":5},0,0,null,0,0,0]
[{"$nulls":12},"",null,0,{"$nulls":5},0,0,null,0,0,0]
[{"$nulls":12},"",null,0,{"$nulls":5},0,0,null,0,0,0]
[{"$nulls":12},"",null,0,{"$nulls":5},0,0,null,0,0,0]
[{"$nulls":12},"",null,0,{"$nulls":5},0,0,null,0,0,0]
[{"$nulls":12},"",null,0,{"$nulls":5},0,0,null,0,0,0]
[{"$nulls":12},"",null,0,{"$nulls":5},0,0,null,0,0,0]
[{"$nulls":10},"Page Total",{"$f":"IF(M43>3,SUM(L15:L40)-V41,\"Please fill in\")","v":"Please fill in"},null,{"$f":"COUNTIF(N16:N40,\"x\")","v":0},{"$nulls":6},{"$f":"SUM(U15:U40)+X41","v":0},{"$f":"SUM(V16:V40)","v":0},{"$f":"COUNTA(W16:W40)","v":0},{"$f":"SUM(X16:X40)","v":0},{"$f":"SUM(Y16:Y40)","v":0}]
[{"$f":"IF(L42>0,\"DON’T FORGET TO ATTACH YOUR RECEIPT DOCUMENTATION TO THE EMAIL\",\"\")","v":""},{"$nulls":9},"Total of Receipts to be Mailed",{"$f":"IF(FundCode<>500,COUNT(L14:L38),IF(M43>3,SUM(O15:O40),\"the yellow spaces\"))","v":0}]
[{"$nulls":11},{"$f":"IF(L41=\"please fill in\",\"yellow spaces\",\"\")","v":"yellow spaces"},{"$f":"Summary!O12","v":{"v":1,"d":"1.00"}}]
[{"$nulls":10},"Office Expense Grand Total",{"$f":"IF(M43>3,L41+U41,\"on summary page\")","v":"on summary page"}]

{"sheet":"Out-of-town Travel","index":9,"n_rows":45,"n_cols":25,"rows_kept":45,"merged":[[7,6,7,8],[7,9,7,11],[8,6,8,8],[8,9,8,11],[9,6,9,8],[9,9,9,11],[10,6,10,8],[10,9,10,11],[11,6,11,8],[11,9,11,11],[12,6,12,8],[12,9,12,11],[13,1,13,3],[13,7,13,10],[13,15,13,19],[13,20,14,20],[13,21,14,21],[13,22,14,22],[13,23,14,23],[13,24,14,24],[14,1,14,3],[14,4,14,6],[14,7,14,10],[14,16,14,19],[15,1,15,3],[15,4,15,6],[15,7,15,10],[16,1,16,3],[16,4,16,6],[16,7,16,10],[16,16,16,19],[17,1,17,3],[17,4,17,6],[17,7,17,10],[17,16,17,19],[18,1,18,3],[18,4,18,6],[18,7,18,10],[18,16,18,19],[19,1,19,3],[19,4,19,6],[19,7,19,10],[19,16,19,19],[20,1,20,3],[20,4,20,6],[20,7,20,10],[20,16,20,19],[21,1,21,3],[21,4,21,6],[21,7,21,10],[21,16,21,19],[22,1,22,3],[22,4,22,6],[22,7,22,10],[22,16,22,19],[23,1,23,3],[23,4,23,6],[23,7,23,10],[23,16,23,19],[24,1,24,3],[24,4,24,6],[24,7,24,10],[24,16,24,19],[25,1,25,3],[25,4,25,6],[25,7,25,10],[25,16,25,19],[26,1,26,3],[26,4,26,6],[26,7,26,10],[26,16,26,19],[27,1,27,3],[27,4,27,6],[27,7,27,10],[27,16,27,19],[28,1,28,3],[28,4,28,6],[28,7,28,10],[28,16,28,19],[29,1,29,3],[29,4,29,6],[29,7,29,10],[29,16,29,19],[30,1,30,3],[30,4,30,6],[30,7,30,10],[30,16,30,19],[31,1,31,3],[31,4,31,6],[31,7,31,10],[31,16,31,19],[32,1,32,3],[32,4,32,6],[32,7,32,10],[32,16,32,19],[33,1,33,3],[33,4,33,6],[33,7,33,10],[33,16,33,19],[34,1,34,3],[34,4,34,6],[34,7,34,10],[34,16,34,19],[35,1,35,3],[35,4,35,6],[35,7,35,10],[35,16,35,19],[36,1,36,3],[36,4,36,6],[36,7,36,10],[36,16,36,19],[37,1,37,3],[37,4,37,6],[37,7,37,10],[37,16,37,19],[38,1,38,3],[38,4,38,6],[38,7,38,10],[38,16,38,19],[39,1,39,3],[39,4,39,6],[39,7,39,10],[39,16,39,19],[40,1,40,3],[40,4,40,6],[40,7,40,10],[40,16,40,19],[41,16,41,19],[42,0,45,7]]}
["EXAMPLES",{"$nulls":8},"Name",{"$f":"'Office Expense'!K1","v":" "}]
[null,"KEYWORD HERE IS OUT OF TOWN - AT LEAST OVERNIGHT!",{"$nulls":7},"Dept/Project",{"$f":"'Office Expense'!K2","v":0}]
[null,"This category is for TRIP expenses."]
[null,"Out-of-town ISI ministry travel (mileage should be put on the Mileage Log)"]
[null,"      Airline tickets",{"$nulls":3},"      Food while traveling (NOT donor meals)"]
[null,"      Rental Car (plus gas)",{"$nulls":3},"      Out-of-town Cab Fare, Bus, Subway, etc."]
[]
["*ORIGINAL Receipt required if $75.00 or greater",{"$nulls":5},"Abbreviations:"]
["   List complete information below for all expenses.",{"$nulls":5},"PD=Partnership Development"]
[{"$nulls":6},"ICF=International Christian Fellowship"]
["**Expenses must be submitted with "]
["   in 60 days of being incurred."]
[]
["Date","Name of person",{"$nulls":5},"Location",{"$nulls":7},"office use only",{"$nulls":4},"amt  +/-","disallow","exception","disallow","for audit work"]
["(mm/dd/yy)","and Type of Item",null,null,"Ministry purpose",null,null,"(Company/Hotel/Airline and City and State)",{"$nulls":3},"Amount",{"$nulls":3},"initials","correction explanation"]
[{"$nulls":12},{"$f":"IF(L16>=75,\"*\",\" \")","v":" "},null,{"$f":"IF(L16>=75,L16,\" \")","v":" "}]
[{"$nulls":12},{"$f":"IF(A17>0,IF(submit_date>0,IF(submit_date-A17>60,\"disallow\",IF(L17>=75,IF(AND(N17=\"\",TODAY()-submit_date>30),\"disallow\",\"*\"),\" \")),IF(TODAY()-A17>60,\"disallow\",IF(L17>=75,IF(AND(N17=\"\",TODAY()-submit_date>30),\"disallow\",\"*\"),\" \"))),IF(L17>=75,IF(AND(N17=\"\",TODAY()-submit_date>30),\"disallow\",\"*\"),\"\"))","v":""},null,{"$f":"IF(AND(L17>=75,M17<>\"disallow\"),1,\" \")","v":" "},{"$nulls":6},{"$f":"IF(AND(M17=\"disallow\",W17=0),L17,0)","v":0},null,{"$f":"IF(W17>0,-U17,0)","v":0},{"$f":"IF(AND(A17<Fiscal_Start_Date,submit_date-A17<90,submit_date>=0),L17,0)","v":0}]
[{"$nulls":12},"",null,{"$f":"IF(AND(L18>=75,M18<>\"disallow\"),1,\" \")","v":" "},{"$nulls":6},{"$f":"IF(AND(M18=\"disallow\",W18=0),L18,0)","v":0},null,{"$f":"IF(W18>0,-U18,0)","v":0},0]
[{"$nulls":12},"",null," ",{"$nulls":6},0,null,0,0]
[{"$nulls":12},"",null," ",{"$nulls":6},0,null,0,0]
[{"$nulls":12},"",null," ",{"$nulls":6},0,null,0,0]
[{"$nulls":12},"",null," ",{"$nulls":6},0,null,0,0]
[{"$nulls":12},"",null," ",{"$nulls":6},0,null,0,0]
[{"$nulls":12},"",null," ",{"$nulls":6},0,null,0,0]
[{"$nulls":12},"",null," ",{"$nulls":6},0,null,0,0]
[{"$nulls":12},"",null," ",{"$nulls":6},0,null,0,0]
[{"$nulls":12},"",null," ",{"$nulls":6},0,null,0,0]
[{"$nulls":12},"",null," ",{"$nulls":6},0,null,0,0]
[{"$nulls":12},"",null," ",{"$nulls":6},0,null,0,0]
[{"$nulls":12},"",null," ",{"$nulls":6},0,null,0,0]
[{"$nulls":12},"",null," ",{"$nulls":6},0,null,0,0]
[{"$nulls":12},"",null," ",{"$nulls":6},0,null,0,0]
[{"$nulls":12},"",null," ",{"$nulls":6},0,null,0,0]
[{"$nulls":12},"",null," ",{"$nulls":6},0,null,0,0]
[{"$nulls":12},"",null," ",{"$nulls":6},0,null,0,0]
[{"$nulls":12},"",null," ",{"$nulls":6},0,null,0,0]
[{"$nulls":12},"",null," ",{"$nulls":6},0,null,0,0]
[{"$nulls":12},"",null," ",{"$nulls":6},0,null,0,0]
[{"$nulls":12},"",null," ",{"$nulls":6},0,null,0,0]
[{"$nulls":12},"",null," ",{"$nulls":6},0,null,0,0]
[{"$nulls":12},"",null," ",{"$nulls":6},0,null,0,0]
[{"$nulls":10},"Page Total",{"$f":"IF(L44>3,SUM(L16:L41)-V42,\"Please fill in yellow\")","v":"Please fill in yellow"},null,{"$f":"COUNTIF(N17:N41,\"x\")","v":0},{"$nulls":6},{"$f":"SUM(U17:U41)+X42","v":0},{"$f":"SUM(V17:V41)","v":0},{"$f":"COUNTA(W17:W41)","v":0},{"$f":"SUM(X17:X41)","v":0},{"$f":"SUM(Y17:Y41)","v":0}]
[{"$f":"IF(L43>0,\"DON’T FORGET TO ATTACH YOUR RECEIPT DOCUMENTATION TO THE EMAIL\",\"\")","v":""},{"$nulls":9},"Total of Receipts to be Mailed",{"$f":"IF(FundCode<>500,COUNT(L13:L37),IF(L44>3,SUM(O16:O41),0))","v":0}]
[{"$nulls":11},{"$f":"Summary!O12","v":{"v":1,"d":"1.00"}}]
[{"$nulls":10}," Out of Town Travel Grand Total",{"$f":"IF(L44>3,L42+U42,\"spaces on summary page\")","v":"spaces on summary page"}]

{"sheet":"Professional Growth","index":10,"n_rows":44,"n_cols":25,"rows_kept":44,"merged":[[4,6,4,8],[4,9,4,11],[5,6,5,8],[5,9,5,11],[6,6,6,8],[6,9,6,11],[7,6,7,8],[7,9,7,11],[8,6,8,8],[8,9,8,11],[9,6,9,8],[9,9,9,11],[11,1,12,3],[11,4,12,6],[11,7,11,10],[11,15,11,19],[11,20,12,20],[11,21,12,21],[11,22,12,22],[11,23,12,23],[11,24,12,24],[12,7,12,10],[12,16,12,19],[13,1,13,3],[13,4,13,6],[13,7,13,10],[14,1,14,3],[14,4,14,6],[14,7,14,10],[14,16,14,19],[15,1,15,3],[15,4,15,6],[15,7,15,10],[15,16,15,19],[16,1,16,3],[16,4,16,6],[16,7,16,10],[16,16,16,19],[17,1,17,3],[17,4,17,6],[17,7,17,10],[17,16,17,19],[18,1,18,3],[18,4,18,6],[18,7,18,10],[18,16,18,19],[19,1,19,3],[19,4,19,6],[19,7,19,10],[19,16,19,19],[20,1,20,3],[20,4,20,6],[20,7,20,10],[20,16,20,19],[21,1,21,3],[21,4,21,6],[21,7,21,10],[21,16,21,19],[22,1,22,3],[22,4,22,6],[22,7,22,10],[22,16,22,19],[23,1,23,3],[23,4,23,6],[23,7,23,10],[23,16,23,19],[24,1,24,3],[24,4,24,6],[24,7,24,10],[24,16,24,19],[25,1,25,3],[25,4,25,6],[25,7,25,10],[25,16,25,19],[26,1,26,3],[26,4,26,6],[26,7,26,10],[26,16,26,19],[27,1,27,3],[27,4,27,6],[27,7,27,10],[27,16,27,19],[28,1,28,3],[28,4,28,6],[28,7,28,10],[28,16,28,19],[29,1,29,3],[29,4,29,6],[29,7,29,10],[29,16,29,19],[30,1,30,3],[30,4,30,6],[30,7,30,10],[30,16,30,19],[31,1,31,3],[31,4,31,6],[31,7,31,10],[31,16,31,19],[32,1,32,3],[32,4,32,6],[32,7,32,10],[32,16,32,19],[33,1,33,3],[33,4,33,6],[33,7,33,10],[33,16,33,19],[34,1,34,3],[34,4,34,6],[34,7,34,10],[34,16,34,19],[35,1,35,3],[35,4,35,6],[35,7,35,10],[35,16,35,19],[36,1,36,3],[36,4,36,6],[36,7,36,10],[36,16,36,19],[37,1,37,3],[37,4,37,6],[37,7,37,10],[37,16,37,19],[38,1,38,3],[38,4,38,6],[38,7,38,10],[38,16,38,19],[39,1,39,3],[39,4,39,6],[39,7,39,10],[39,16,39,19],[41,0,44,7]]}
["EXAMPLES",{"$nulls":8},"Name",{"$f":"'Out-of-town Travel'!K1","v":" "}]
[null,"Seminars",{"$nulls":3},"ISI Conferences",{"$nulls":3},"Dept/Project",{"$f":"'Out-of-town Travel'!K2","v":0}]
[null,"Books",{"$nulls":3},"Training"]
[null,"Tapes"]
[{"$nulls":6},"Abbreviations:"]
["*ORIGNINALReceipts required if $75.00 or greater",{"$nulls":5},"PD=Partnership Development"]
["   List complete information below for all expenses.",{"$nulls":5},"ICF=International Christian Fellowship"]
[]
["**Expenses must be submitted with"]
["   in 60 days of being incurred."]
[]
["Date","Title of book or course",null,null,"Ministry purpose",null,null,"Location",{"$nulls":7},"office use only",{"$nulls":4},"amt  +/-","disallow","exception","disallow","for audit work"]
["(mm/dd/yy)",{"$nulls":6},"(Company and City and State)",{"$nulls":3},"Amount",{"$nulls":3},"initials","correction explanation"]
[{"$nulls":12},{"$f":"IF(L14>=75,\"*\",\" \")","v":" "},null,{"$f":"IF(L14>=75,L14,\" \")","v":" "}]
[{"$nulls":12},{"$f":"IF(A15>0,IF(submit_date>0,IF(submit_date-A15>60,\"disallow\",IF(L15>=75,IF(AND(N15=\"\",TODAY()-submit_date>30),\"disallow\",\"*\"),\" \")),IF(TODAY()-A15>60,\"disallow\",IF(L15>=75,IF(AND(N15=\"\",TODAY()-submit_date>30),\"disallow\",\"*\"),\" \"))),IF(L15>=75,IF(AND(N15=\"\",TODAY()-submit_date>30),\"disallow\",\"*\"),\"\"))","v":""},null,{"$f":"IF(AND(L15>=75,M15<>\"disallow\"),1,\" \")","v":" "},{"$nulls":6},{"$f":"IF(AND(W15=0,M15=\"disallow\"),L15,0)","v":0},null,{"$f":"IF(W15>0,-U15,0)","v":0},{"$f":"IF(AND(A15<Fiscal_Start_Date,submit_date-A15<90,submit_date>=0),L15,0)","v":0}]
[{"$nulls":12},"",null,{"$f":"IF(AND(L16>=75,M16<>\"disallow\"),1,\" \")","v":" "},{"$nulls":6},{"$f":"IF(AND(W16=0,M16=\"disallow\"),L16,0)","v":0},null,{"$f":"IF(W16>0,-U16,0)","v":0},0]
[{"$nulls":12},"",null," ",{"$nulls":6},0,null,0,0]
[{"$nulls":12},"",null," ",{"$nulls":6},0,null,0,0]
[{"$nulls":12},"",null," ",{"$nulls":6},0,null,0,0]
[{"$nulls":12},"",null," ",{"$nulls":6},0,null,0,0]
[{"$nulls":12},"",null," ",{"$nulls":6},0,null,0,0]
[{"$nulls":12},"",null," ",{"$nulls":6},0,null,0,0]
[{"$nulls":12},"",null," ",{"$nulls":6},0,null,0,0]
[{"$nulls":12},"",null," ",{"$nulls":6},0,null,0,0]
[{"$nulls":12},"",null," ",{"$nulls":6},0,null,0,0]
[{"$nulls":12},"",null," ",{"$nulls":6},0,null,0,0]
[{"$nulls":12},"",null," ",{"$nulls":6},0,null,0,0]
[{"$nulls":12},"",null," ",{"$nulls":6},0,null,0,0]
[{"$nulls":12},"",null," ",{"$nulls":6},0,null,0,0]
[{"$nulls":12},"",null," ",{"$nulls":6},0,null,0,0]
[{"$nulls":12},"",null," ",{"$nulls":6},0,null,0,0]
[{"$nulls":12},"",null," ",{"$nulls":6},0,null,0,0]
[{"$nulls":12},"",null," ",{"$nulls":6},0,null,0,0]
[{"$nulls":12},"",null," ",{"$nulls":6},0,null,0,0]
[{"$nulls":12},"",null," ",{"$nulls":6},0,null,0,0]
[{"$nulls":12},"",null," ",{"$nulls":6},0,null,0,0]
[{"$nulls":12},"",null," ",{"$nulls":6},0,null,0,0]
[{"$nulls":12},"",null," ",{"$nulls":6},0,null,0,0]
[{"$nulls":12},"",null," ",{"$nulls":6},0,null,0,0]
[{"$nulls":12},"",null," ",{"$nulls":6},0,null,0,0]
[{"$nulls":10},"Page Total",{"$f":"IF(M43>3,SUM(L15:L40)-V41,\"Please fill in\")","v":"Please fill in"},null,{"$f":"COUNTIF(N15:N40,\"x\")","v":{"v":0,"d":"0.00"}},{"$nulls":6},{"$f":"SUM(U15:U40)+X41","v":0},{"$f":"SUM(V15:V40)","v":0},{"$f":"COUNTA(W15:W40)","v":0},{"$f":"SUM(X15:X40)","v":0},{"$f":"SUM(Y15:Y40)","v":0}]
[{"$f":"IF(L42>0,\"DON’T FORGET TO ATTACH YOUR RECEIPT DOCUMENTATION TO THE EMAIL\",\"\")","v":""},{"$nulls":9},"Total of Receipts to be Mailed",{"$f":"IF(FundCode<>500,COUNT(L14:L38),IF(M43>3,SUM(O15:O40),0))","v":0}]
[{"$nulls":11},{"$f":"IF(L41=\"please fill in\",\"yellow spaces\",\"\")","v":"yellow spaces"},{"$f":"Summary!O12","v":{"v":1,"d":"1.00"}}]
[{"$nulls":10},"Professional Growth Grand Total",{"$f":"IF(M43>3,L41+U41,\"on summary page\")","v":"on summary page"}]

{"sheet":"Ministry Ops","index":11,"n_rows":44,"n_cols":25,"rows_kept":44,"merged":[[7,6,7,8],[7,9,7,11],[8,6,8,8],[8,9,8,11],[9,6,9,8],[9,9,9,11],[10,6,10,8],[10,9,10,11],[11,6,11,8],[11,9,11,11],[12,6,12,8],[12,9,12,11],[13,1,13,3],[13,7,13,10],[13,15,13,19],[13,20,14,20],[13,21,14,21],[13,22,14,22],[13,23,14,23],[13,24,14,24],[14,1,14,3],[14,4,14,6],[14,7,14,10],[14,16,14,19],[15,1,15,3],[15,4,15,6],[15,7,15,10],[16,1,16,3],[16,4,16,6],[16,7,16,10],[16,16,16,19],[17,1,17,3],[17,4,17,6],[17,7,17,10],[17,16,17,19],[18,1,18,3],[18,4,18,6],[18,7,18,10],[18,16,18,19],[19,1,19,3],[19,4,19,6],[19,7,19,10],[19,16,19,19],[20,1,20,3],[20,4,20,6],[20,7,20,10],[20,16,20,19],[21,1,21,3],[21,4,21,6],[21,7,21,10],[21,16,21,19],[22,1,22,3],[22,4,22,6],[22,7,22,10],[22,16,22,19],[23,1,23,3],[23,4,23,6],[23,7,23,10],[23,16,23,19],[24,1,24,3],[24,4,24,6],[24,7,24,10],[24,16,24,19],[25,1,25,3],[25,4,25,6],[25,7,25,10],[25,16,25,19],[26,1,26,3],[26,4,26,6],[26,7,26,10],[26,16,26,19],[27,1,27,3],[27,4,27,6],[27,7,27,10],[27,16,27,19],[28,1,28,3],[28,4,28,6],[28,7,28,10],[28,16,28,19],[29,1,29,3],[29,4,29,6],[29,7,29,10],[29,16,29,19],[30,1,30,3],[30,4,30,6],[30,7,30,10],[30,16,30,19],[31,1,31,3],[31,4,31,6],[31,7,31,10],[31,16,31,19],[32,1,32,3],[32,4,32,6],[32,7,32,10],[32,16,32,19],[33,1,33,3],[33,4,33,6],[33,7,33,10],[33,16,33,19],[34,1,34,3],[34,4,34,6],[34,7,34,10],[34,16,34,19],[35,1,35,3],[35,4,35,6],[35,7,35,10],[35,16,35,19],[36,1,36,3],[36,4,36,6],[36,7,36,10],[36,16,36,19],[37,1,37,3],[37,4,37,6],[37,7,37,10],[37,16,37,19],[38,1,38,3],[38,4,38,6],[38,7,38,10],[40,0,43,7]]}
["EXAMPLES",{"$nulls":8},"Name",{"$f":"'Professional Growth'!K1","v":" "}]
[null,"ALL DIRECT COSTS PERTAINING TO YOUR MINISTRY OUTREACH",{"$nulls":7},"Dept/Project",{"$f":"'Professional Growth'!K2","v":0}]
[null,"Meals with international students (in your home or out)",{"$nulls":4},"Handouts for students"]
[null,"Materials for ICF meetings",{"$nulls":4},"Gifts to volunteers limited to $75"]
[null,"Gifts to students limited to $150",{"$nulls":4},"Planning Meetings"]
[null,"Videos, Books, etc. given to students",{"$nulls":4},"Local Meetings/Conferences "]
[]
["*ORIGINAL Receipt required if $75.00 or greater",{"$nulls":5},"Abbreviations:"]
["   List complete information below for all expenses.",{"$nulls":5},"PD=Partnership Development"]
[{"$nulls":6},"ICF=International Christian Fellowship"]
["**Expenses must be submitted with"]
["   in 60 days of being incurred."]
[]
["Date","Name of Student",{"$nulls":5},"Location",{"$nulls":7},"office use only",{"$nulls":4},"amt  +/-","disallow","exception",null,"for audit work"]
["(mm/dd/yy)","and Type of Item",null,null,"Ministry purpose",null,null,"(Company/Restaurant and City and State)",{"$nulls":3},"Amount",{"$nulls":3},"initials","correction explanation"]
[{"$nulls":12},{"$f":"IF(L16>=75,\"*\",\" \")","v":" "},null,{"$f":"IF(L16>=75,L16,\" \")","v":" "}]
[{"$nulls":12},{"$f":"IF(A17>0,IF(submit_date>0,IF(submit_date-A17>60,\"disallow\",IF(L17>=75,IF(AND(N17=\"\",TODAY()-submit_date>30),\"disallow\",\"*\"),\" \")),IF(TODAY()-A17>60,\"disallow\",IF(L17>=75,IF(AND(N17=\"\",TODAY()-submit_date>30),\"disallow\",\"*\"),\" \"))),IF(L17>=75,IF(AND(N17=\"\",TODAY()-submit_date>30),\"disallow\",\"*\"),\"\"))","v":""},null,{"$f":"IF(AND(L17>=75,M17<>\"disallow\"),1,\" \")","v":" "},{"$nulls":6},{"$f":"IF(AND(W17=0,M17=\"disallow\"),L17,0)","v":0},null,{"$f":"IF(W17>0,-U17,0)","v":0},{"$f":"IF(AND(A17<Fiscal_Start_Date,submit_date-A17<90,submit_date>=0),L17,0)","v":0}]
[{"$nulls":12},"",null,{"$f":"IF(AND(L18>=75,M18<>\"disallow\"),1,\" \")","v":" "},{"$nulls":6},{"$f":"IF(AND(W18=0,M18=\"disallow\"),L18,0)","v":0},null,{"$f":"IF(W18>0,-U18,0)","v":0},0]
[{"$nulls":12},"",null," ",{"$nulls":6},0,null,{"$f":"IF(W19>0,-U19,0)","v":0},0]
[{"$nulls":12},"",null," ",{"$nulls":6},0,null,0,0]
[{"$nulls":12},"",null," ",{"$nulls":6},0,null,0,0]
[{"$nulls":12},"",null," ",{"$nulls":6},0,null,0,0]
[{"$nulls":12},"",null," ",{"$nulls":6},0,null,0,0]
[{"$nulls":12},"",null," ",{"$nulls":6},0,null,0,0]
[{"$nulls":12},"",null," ",{"$nulls":6},0,null,0,0]
[{"$nulls":12},"",null," ",{"$nulls":6},0,null,0,0]
[{"$nulls":12},"",null," ",{"$nulls":6},0,null,0,0]
[{"$nulls":12},"",null," ",{"$nulls":6},0,null,0,0]
[{"$nulls":12},"",null," ",{"$nulls":6},0,null,0,0]
[{"$nulls":12},"",null," ",{"$nulls":6},0,null,0,0]
[{"$nulls":12},"",null," ",{"$nulls":6},0,null,0,0]
[{"$nulls":12},"",null," ",{"$nulls":6},0,null,0,0]
[{"$nulls":12},"",null," ",{"$nulls":6},0,null,0,0]
[{"$nulls":12},"",null," ",{"$nulls":6},0,null,0,0]
[{"$nulls":12},"",null," ",{"$nulls":6},0,null,0,0]
[{"$nulls":12},"",null," ",{"$nulls":6},0,null,0,0]
[{"$nulls":12},"",null," ",{"$nulls":6},0,null,0,0]
[{"$nulls":12},"",null," ",{"$nulls":6},0,null,0,0]
[{"$nulls":12},"",null," ",{"$nulls":6},0,null,0,0]
[{"$nulls":10},"Subtotal",{"$f":"IF(L43>3,SUM(L17:L39)-V40,\"Please fill in\")","v":"Please fill in"},null,{"$f":"COUNTIF(N17:N39,\"x\")","v":0},{"$nulls":6},{"$f":"SUM(U17:U39)+X40","v":0},{"$f":"SUM(V17:V39)","v":0},{"$f":"COUNTA(W17:W39)","v":0},{"$f":"SUM(X17:X39)","v":0},{"$f":"SUM(Y17:Y39)","v":0}]
[{"$f":"IF(L42>0,\"DON’T FORGET TO ATTACH YOUR RECEIPT DOCUMENTATION TO THE EMAIL\",\"\")","v":""},{"$nulls":9},"Total from Meals sheet",{"$f":"IF(L43>3,'Meals-Students'!D47,\"the yellow spaces on\")","v":"the yellow spaces on"}]
[{"$nulls":10},"Total of Receipts to be Mailed",{"$f":"IF(FundCode<>500,COUNT(L14:L37),IF(L43>3,SUM(O16:O39),0))","v":0}]
[{"$nulls":11},{"$f":"Summary!O12","v":{"v":1,"d":"1.00"}}]
[{"$nulls":10},"Ministry Operations Grand Total",{"$f":"IF(L43>3,L40+L41+U40,\"summary page\")","v":"summary page"}]

{"sheet":"Meals-Students","index":12,"n_rows":47,"n_cols":24,"rows_kept":47,"merged":[[0,0,0,1],[0,2,0,3],[1,0,1,1],[1,2,1,3],[2,0,2,1],[2,2,2,3],[3,0,3,1],[3,2,3,3],[4,0,4,1],[4,2,4,3],[5,0,5,1],[5,2,5,3],[9,8,9,12],[10,1,10,3],[10,4,11,4],[10,5,11,5],[10,8,10,11],[10,16,10,19],[10,20,11,20],[10,21,10,23],[11,13,11,15],[12,11,12,12],[13,11,13,12],[14,11,14,12],[15,11,15,12],[16,11,16,12],[17,11,17,12],[18,11,18,12],[19,11,19,12],[20,11,20,12],[21,11,21,12],[22,11,22,12],[23,11,23,12],[24,11,24,12],[25,11,25,12],[26,11,26,12],[27,11,27,12],[28,11,28,12],[29,11,29,12],[30,11,30,12],[31,11,31,12],[32,11,32,12],[33,11,33,12],[34,11,34,12],[35,11,35,12],[36,11,36,12],[37,11,37,12],[38,11,38,12],[39,11,39,12],[40,11,40,12],[41,11,41,12],[42,11,42,12]]}
["Abbreviations:",{"$nulls":4},"Monthly Meals Sheet-students"]
["PD=Partnership Development",{"$nulls":4},"For meals provided in your home. "]
["ICF=Int'l Christian Fellowship",{"$nulls":4},"No grocery receipts are required."]
[]
[{"$nulls":4},"Staff: ",{"$f":"Donor!K1","v":" "}]
[]
[{"$nulls":4},"Dept/Project",{"$f":"Donor!K2","v":0}]
[]
["The meal sheet should not be used for planned events, but rather for drop by visits"]
[{"$nulls":8},"Office Use only"]
["Date","Number of Guest at Meal:",null,null,"Ministry purpose","Student/Volunteers                             (no hosts)                                       (use as multiple lines if needed)",null,null,"Correctiion",{"$nulls":7},"Exception",{"$nulls":3},"for audit work","limit on reimb level"]
["(mm/dd/yy)","Breakfast","Lunch","Supper",{"$nulls":3},"Initials","break","lunch","dinner","reason for adjustment",null,"disallowed",null,null,"initials","break","lunch","dinner",null,"break","lunch","dinner"]
[{"$nulls":6},{"$f":"IF(A13>0,IF(submit_date>0,IF(submit_date-A13>60,\"disallow\",\" \"),IF(TODAY()-A13>60,\"disallow\",\" \")),\"\")","v":""},{"$nulls":4}," ",null,{"$f":"IF(AND($G13=\"disallow\",Q$13=0),B13,0)","v":0},{"$f":"IF(AND($G13=\"disallow\",Q$13=0),C13,0)","v":0},{"$f":"IF(AND($G13=\"disallow\",Q$13=0),D13,0)","v":0},null,{"$f":"IF($Q13>0,I13,0)","v":0},{"$f":"IF($Q13>0,J13,0)","v":0},{"$f":"IF($Q13>0,K13,0)","v":0},{"$f":"IF(AND(A13<Fiscal_Start_Date,submit_date-A13<90,submit_date>=Fiscal_Start_Date),B13*$B$45+C13*$C$45+D13*$D$45,0)","v":0},{"$f":"IF($B13>7,$B13-7,0)","v":0},{"$f":"IF($C13>7,$C13-7,0)","v":0},{"$f":"IF($D13>7,$D13-7,0)","v":0}]
[{"$nulls":6},"",{"$nulls":4}," ",null,{"$f":"IF(AND($G14=\"disallow\",Q$13=0),B14,0)","v":0},{"$f":"IF(AND($G14=\"disallow\",Q$13=0),C14,0)","v":0},{"$f":"IF(AND($G14=\"disallow\",Q$13=0),D14,0)","v":0},null,{"$f":"IF($Q14>0,I14,0)","v":0},0,0,0,{"$f":"IF($B14>7,$B14-7,0)","v":0},{"$f":"IF($C14>7,$C14-7,0)","v":0},{"$f":"IF($D14>7,$D14-7,0)","v":0}]
[{"$nulls":6},"",{"$nulls":4}," ",null,0,0,0,null,0,0,0,0,0,0,0]
[{"$nulls":6},"",{"$nulls":4}," ",null,0,0,0,null,0,0,0,0,0,0,0]
[{"$nulls":6},"",{"$nulls":4}," ",null,0,0,0,null,0,0,0,0,0,0,0]
[{"$nulls":6},"",{"$nulls":4}," ",null,0,0,0,null,0,0,0,0,0,0,0]
[{"$nulls":6},"",{"$nulls":4}," ",null,0,0,0,null,0,0,0,0,0,0,0]
[{"$nulls":6},"",{"$nulls":4}," ",null,0,0,0,null,0,0,0,0,0,0,0]
[{"$nulls":6},"",{"$nulls":4}," ",null,{"$f":"IF(AND($G21=\"disallow\",Q$13=0),B21,0)","v":0},0,0,null,{"$f":"IF($Q21>0,I21+N21,0)","v":0},{"$f":"IF($Q21>0,J21+O21,0)","v":0},{"$f":"IF($Q21>0,K21+P21,0)","v":0},0,0,0,0]
[{"$nulls":6},"",{"$nulls":4},"  ",null,0,0,0,null,0,0,0,0,0,0,0]
[{"$nulls":6},"",{"$nulls":4}," ",null,0,0,0,null,0,0,0,0,0,0,0]
[{"$nulls":6},"",{"$nulls":4}," ",null,0,0,0,null,0,0,0,0,0,0,0]
[{"$nulls":6},"",{"$nulls":4}," ",null,0,0,0,null,0,0,0,0,0,0,0]
[{"$nulls":6},"",{"$nulls":4}," ",null,0,0,0,null,0,0,0,0,0,0,0]
[{"$nulls":6},"",{"$nulls":4}," ",null,0,0,0,null,0,0,0,0,0,0,0]
[{"$nulls":6},"",{"$nulls":4}," ",null,0,0,0,null,0,0,0,0,0,0,0]
[{"$nulls":6},"",{"$nulls":4}," ",null,0,0,0,null,0,0,0,0,0,0,0]
[{"$nulls":6},"",{"$nulls":4}," ",null,0,0,0,null,0,0,0,0,0,0,0]
[{"$nulls":6},"",{"$nulls":4}," ",null,0,0,0,null,0,0,0,0,0,0,0]
[{"$nulls":6},"",{"$nulls":4},"  ",null,0,0,0,null,0,0,0,0,0,0,0]
[{"$nulls":6},"",{"$nulls":4}," ",null,0,0,0,null,0,0,0,0,0,0,0]
[{"$nulls":6},"",{"$nulls":4}," ",null,0,0,0,null,0,0,0,0,0,0,0]
[{"$nulls":6},"",{"$nulls":4}," ",null,0,0,0,null,0,0,0,0,0,0,0]
[{"$nulls":6},"",{"$nulls":4}," ",null,0,0,0,null,0,0,0,0,0,0,0]
[{"$nulls":6},"",{"$nulls":4}," ",null,0,0,0,null,0,0,0,0,0,0,0]
[{"$nulls":6},"",{"$nulls":4}," ",null,0,0,0,null,0,0,0,0,0,0,0]
[{"$nulls":6},"",{"$nulls":4}," ",null,0,0,0,null,0,0,0,0,0,0,0]
[{"$nulls":6},"",{"$nulls":4}," ",null,0,0,0,null,0,0,0,0,0,0,0]
[{"$nulls":6},"",{"$nulls":4}," ",null,0,0,0,null,0,0,0,0,0,0,0]
[{"$nulls":6},"",{"$nulls":4}," ",null,0,0,0,null,0,0,0,0,0,0,0]
[{"$nulls":6},"",{"$nulls":4}," ",null,0,0,0,null,0,0,0,0,0,0,0]
["Subtotal",{"$f":"SUM(B13:B43)-N44+I44-V44","v":0},{"$f":"SUM(C13:C43)-O44+J44-W44","v":0},{"$f":"SUM(D13:D43)-P44+K44-X44","v":0},{"$nulls":4},{"$f":"-SUM(I13:I43)+R44","v":0},{"$f":"-SUM(J13:J43)+S44","v":0},{"$f":"-SUM(K13:K43)+T44","v":0},{"$f":"L13&L14&L15&L16&L17&L18&L19&L20&L21&L22&L23&L24&L25&L26&L27&L28&L29&L30&L31&L32&L33&L34&L35&L36&L37&L38&L39&L40&L41&L42&L43","v":"                                 "},null,{"$f":"SUM(N13:N43)","v":0},{"$f":"SUM(O13:O43)","v":0},{"$f":"SUM(P13:P43)","v":0},{"$f":"COUNTA(Q13:Q43)","v":0},{"$f":"SUM(R13:R43)","v":0},0,0,0,0,0,0]
["x Rate",4,7,10]
["Totl",{"$f":"IF(E47>3,B44*B45,\"Please Fill\")","v":"Please Fill"},{"$f":"IF(E47>3,C44*C45,\"in the \")","v":"in the "},{"$f":"IF(E47>3,D44*D45,\"yellow spaces\")","v":"yellow spaces"}]
[{"$nulls":3},{"$f":"IF(E47>3,SUM(B46:D46)+SUM(I44:K44),\"on summary page\")","v":"on summary page"},{"$f":"Summary!O12","v":{"v":1,"d":"1.00"}},"TOTAL"]

{"sheet":"Capital","index":13,"n_rows":48,"n_cols":38,"rows_kept":48,"merged":[[6,5,6,8],[6,9,6,12],[7,5,7,8],[7,9,7,12],[7,22,7,25],[7,27,7,29],[7,30,7,32],[7,33,14,33],[7,34,7,36],[8,5,8,8],[8,9,8,12],[8,22,15,22],[8,23,15,23],[8,24,15,24],[8,25,15,25],[8,26,15,26],[8,27,15,27],[8,28,15,28],[8,29,15,29],[8,30,15,30],[8,31,15,31],[8,32,15,32],[8,34,15,34],[8,35,15,35],[8,36,15,36],[9,5,9,8],[9,9,9,12],[10,5,10,8],[10,9,10,12],[11,5,11,8],[11,9,11,12],[14,1,15,3],[14,4,15,6],[14,7,14,10],[14,11,14,12],[14,16,14,20],[14,21,15,21],[14,37,15,37],[15,7,15,10],[15,17,15,20],[16,1,16,3],[16,4,16,6],[16,7,16,10],[17,1,17,3],[17,4,17,6],[17,7,17,10],[17,17,17,20],[18,1,18,3],[18,4,18,6],[18,7,18,10],[18,17,18,20],[19,1,19,3],[19,4,19,6],[19,7,19,10],[19,17,19,20],[20,1,20,3],[20,4,20,6],[20,7,20,10],[20,17,20,20],[21,1,21,3],[21,4,21,6],[21,7,21,10],[21,17,21,20],[22,1,22,3],[22,4,22,6],[22,7,22,10],[22,17,22,20],[23,1,23,3],[23,4,23,6],[23,7,23,10],[23,17,23,20],[24,1,24,3],[24,4,24,6],[24,7,24,10],[24,17,24,20],[25,1,25,3],[25,4,25,6],[25,7,25,10],[25,17,25,20],[26,1,26,3],[26,4,26,6],[26,7,26,10],[26,17,26,20],[27,1,27,3],[27,4,27,6],[27,7,27,10],[27,17,27,20],[28,1,28,3],[28,4,28,6],[28,7,28,10],[28,17,28,20],[29,1,29,3],[29,4,29,6],[29,7,29,10],[29,17,29,20],[30,1,30,3],[30,4,30,6],[30,7,30,10],[30,17,30,20],[31,1,31,3],[31,4,31,6],[31,7,31,10],[31,17,31,20],[32,1,32,3],[32,4,32,6],[32,7,32,10],[32,17,32,20],[33,1,33,3],[33,4,33,6],[33,7,33,10],[33,17,33,20],[34,1,34,3],[34,4,34,6],[34,7,34,10],[34,17,34,20],[35,1,35,3],[35,4,35,6],[35,7,35,10],[35,17,35,20],[36,1,36,3],[36,4,36,6],[36,7,36,10],[36,17,36,20],[37,1,37,3],[37,4,37,6],[37,7,37,10],[37,17,37,20],[38,1,38,3],[38,4,38,6],[38,7,38,10],[38,17,38,20],[39,1,39,3],[39,4,39,6],[39,7,39,10],[39,17,39,20],[40,1,40,3],[40,4,40,6],[40,7,40,10],[40,17,40,20],[42,0,45,7],[42,23,42,26],[42,27,42,29],[42,30,42,32],[42,34,42,36]]}
["EXAMPLES",{"$nulls":8},"Name",{"$f":"'2nd page'!K1","v":"No grocery receipts are required."}]
[null,"Computers",null,null,"Telephones",{"$nulls":4},"Dept/Project",{"$f":"'2nd page'!K2","v":0}]
[null,"Calculators",null,null,"Office Furniture"]
[null,"File Cabinets",null,null,"Other Assets with a life greater than one year"]
[]
["*All capital purchases for more than"]
["$1000 requires Home Office Approval",{"$nulls":4},"Abbreviations:"]
[{"$nulls":5},"PD=Partnership Development",{"$nulls":16},"normal activity",{"$nulls":4},"disallowed",null,null,"adjusted by HO",null,null,"exceptin","exceptioins"]
["**ORIGINAL RECEIPTS REQUIRED  ",{"$nulls":4},"ICF=International Christian Fellowship",{"$nulls":16},"Count receipts","capital equip > 1000","capital equip on payment plan","Normal purchase","Payment plan purchase > 1000","capital equip > 1000","capital equip on payment plan","Normal purchase","capital equip > 1000","capital equip on payment plan","Normal purchase",null,"capital equip > 1000","capital equip on payment plan","Normal purchase"]
["     on ALL capital expenses"]
[]
["***Expenses must be submitted with"]
["     in 60 days of being incurred."]
[]
["Date","Name of Item",null,null,"Ministry purpose",null,null,"Location",{"$nulls":3},"Payment plans",{"$nulls":4},"office use only",{"$nulls":4},"amt  +/-",{"$nulls":15},"for audit work"]
["(mm/dd/yy)",{"$nulls":6},"(Company and City and State)",{"$nulls":3},"payment #","Purchase Price","Amount",null,null,"initials","correction explanation"]
[{"$nulls":14},{"$f":"IF(N17>=75,\"*\",\" \")","v":" "},{"$nulls":7},{"$f":"IF(O17=\"*\",N17,0)","v":0},{"$f":"IF(N17>500,N17,0)","v":0}]
[{"$nulls":14},{"$f":"IF(A18>0,IF(submit_date>0,IF(submit_date-A18>60,\"disallow\",IF(N18>=75,IF(AND(P18=\"\",TODAY()-submit_date>30),\"disallow\",\"*\"),\" \")),IF(TODAY()-A18>60,\"disallow\",IF(N18>=75,IF(AND(P18=\"\",TODAY()-submit_date>30),\"disallow\",\"*\"),\" \"))),IF(N18>=75,IF(AND(P18=\"\",TODAY()-submit_date>30),\"disallow\",\"*\"),\"\"))","v":""},{"$nulls":7},{"$f":"IF(AND(N18>=75,O18<>\"disallow\"),1,\" \")","v":" "},{"$f":"IF(M18>1000,0,IF(N18>=2500,N18,0))","v":0},{"$f":"IF(M18>=2500,N18,0)","v":0},{"$f":"IF(AND(X18=0,Y18=0),N18,0)","v":0},{"$f":"IF(L18=1,IF(M18>=2500,M18,0),0)","v":0},{"$f":"IF(AND($O18=\"disallow\",AH18=0),X18,0)","v":0},{"$f":"IF(AND($O18=\"disallow\",AH18=0),Y18,0)","v":0},{"$f":"IF(AND($O18=\"disallow\",AH18=0),Z18,0)","v":0},{"$f":"IF(AND(X18>0,AB18=0),V18,0)","v":0},{"$f":"IF(AND(Y18>0,AC18=0),$V18,0)","v":0},{"$f":"IF(AND(Z18>0,AD18=0),$V18,0)","v":0},null,{"$f":"IF(AND(X18>0,AE18<>0,AH18>0),-V18,0)","v":0},{"$f":"IF(AND(Y18>0,AF18<>0,AH18>0),-V18,0)","v":0},{"$f":"IF(AND(AG18<>0,Z18>0,AH18>0),-V18,0)","v":0},{"$f":"IF(AND(A18<Fiscal_Start_Date,submit_date-B18<90,submit_date>=0),N18,0)","v":0}]
[{"$nulls":14},"",{"$nulls":7},{"$f":"IF(AND(N19>=75,O19<>\"disallow\"),1,\" \")","v":" "},{"$f":"IF(M19>1000,0,IF(N19>=2500,N19,0))","v":0},{"$f":"IF(M19>=2500,N19,0)","v":0},{"$f":"IF(AND(X19=0,Y19=0),N19,0)","v":0},{"$f":"IF(L19=1,IF(M19>=2500,M19,0),0)","v":0},{"$f":"IF(AND($O19=\"disallow\",AH19=0),X19,0)","v":0},{"$f":"IF(AND($O19=\"disallow\",AH19=0),Y19,0)","v":0},{"$f":"IF(AND($O19=\"disallow\",AH19=0),Z19,0)","v":0},{"$f":"IF(AND(X19>0,AB19=0),V19,0)","v":0},{"$f":"IF(AND(Y19>0,AC19=0),$V19,0)","v":0},{"$f":"IF(AND(Z19>0,AD19=0),$V19,0)","v":0},null,{"$f":"IF(AND(X19>0,AE19<>0,AH19>0),-V19,0)","v":0},{"$f":"IF(AND(Y19>0,AF19<>0,AH19>0),-V19,0)","v":0},{"$f":"IF(AND(AG19<>0,Z19>0,AH19>0),-V19,0)","v":0},0]
[{"$nulls":14},"",{"$nulls":7}," ",0,0,0,0,0,0,0,0,0,0,null,{"$f":"IF(AND(X20>0,AE20<>0,AH20>0),-V20,0)","v":0},0,0,0]
[{"$nulls":14},"",{"$nulls":7}," ",0,0,0,0,0,0,0,0,0,0,null,0,0,0,0]
[{"$nulls":14},"",{"$nulls":7}," ",0,0,0,0,0,0,0,0,0,0,null,0,0,0,0]
[{"$nulls":14},"",{"$nulls":7}," ",0,0,0,0,0,0,0,0,0,0,null,0,0,0,0]
[{"$nulls":14},"",{"$nulls":7}," ",0,0,0,0,0,0,0,0,0,0,null,0,0,0,0]
[{"$nulls":14},"",{"$nulls":7}," ",0,0,0,0,0,0,0,0,0,0,null,0,0,0,0]
[{"$nulls":14},"",{"$nulls":7}," ",0,0,0,0,0,0,0,0,0,0,null,0,0,0,0]
[{"$nulls":14},"",{"$nulls":7}," ",0,0,0,0,0,0,0,0,0,0,null,0,0,0,0]
[{"$nulls":14},"",{"$nulls":7}," ",0,0,0,0,0,0,0,0,0,0,null,0,0,0,0]
[{"$nulls":14},"",{"$nulls":7}," ",0,0,0,0,0,0,0,0,0,0,null,0,0,0,0]
[{"$nulls":14},"",{"$nulls":7}," ",0,0,0,0,0,0,0,0,0,0,null,0,0,0,0]
[{"$nulls":14},"",{"$nulls":7}," ",0,0,0,0,0,0,0,0,0,0,null,0,0,0,0]
[{"$nulls":14},"",{"$nulls":7}," ",0,0,0,0,0,0,0,0,0,0,null,0,0,0,0]
[{"$nulls":14},"",{"$nulls":7}," ",0,0,0,0,0,0,0,0,0,0,null,0,0,0,0]
[{"$nulls":14},"",{"$nulls":7}," ",0,0,0,0,0,0,0,0,0,0,null,0,0,0,0]
[{"$nulls":14},"",{"$nulls":7}," ",0,0,0,0,0,0,0,0,0,0,null,0,0,0,0]
[{"$nulls":14},"",{"$nulls":7}," ",0,0,0,0,0,0,0,0,0,0,null,0,0,0,0]
[{"$nulls":14},"",{"$nulls":7}," ",0,0,0,0,0,0,0,0,0,0,null,0,0,0,0]
[{"$nulls":14},"",{"$nulls":7}," ",0,0,0,0,0,0,0,0,0,0,null,0,0,0,0]
[{"$nulls":14},"",{"$nulls":7}," ",0,0,0,0,0,0,0,0,0,0,null,0,0,0,0]
[{"$nulls":14},"",{"$nulls":7}," ",0,0,0,0,0,0,0,0,0,0,null,0,0,0,0]
[{"$nulls":14},"",{"$nulls":7}," ",0,0,0,0,0,0,0,0,0,0,null,0,0,0,0]
[{"$nulls":11},{"$f":"SUM(L18:L41)/COUNT(L18:L41)","v":{"$error":"#DIV/0!"}},{"$f":"SUM(M18:M41)","v":0},null,null,{"$f":"COUNTIF(P18:P41,\"x\")","v":0},{"$nulls":5},{"$f":"SUM(V15:V41)","v":0},null,{"$f":"SUM(X17:X41)+AI42","v":0},{"$f":"SUM(Y18:Y41)+AJ42","v":0},{"$f":"SUM(Z18:Z41)+AK42","v":0},{"$f":"SUM(AA18:AA41)","v":0},0,0,0,0,0,0,{"$f":"COUNTA(AH18:AH41)","v":0},{"$f":"SUM(AI18:AI41)","v":0},{"$f":"SUM(AJ18:AJ41)","v":0},{"$f":"SUM(AK18:AK41)","v":0},{"$f":"SUM(AL18:AL41)","v":0}]
[{"$f":"IF(N43>0,\"DON’T FORGET TO ATTACH YOUR RECEIPT DOCUMENTATION TO THE EMAIL\",\"\")","v":""},{"$nulls":11},"Total # of Receipts to be Mailed",{"$f":"IF(FundCode<>500,COUNT(N17:N41),IF(N48>3,SUM(W17:W41),0))","v":0},{"$nulls":9},"normal activity",{"$nulls":3},"disallowed",null,null,"adjusted by HO",{"$nulls":3},"adjusted by HO"]
[{"$nulls":12},"Capital Equipment <$2,500 (Equipment Expense)",{"$f":"IF(N48>3,Z42-AD42+AG42,\"Please fill in the\")","v":"Please fill in the"}]
[{"$nulls":12},"Capital Equipment >$2,500 (Fixed Asset)",{"$f":"IF(N48>3,X42-AB42+AE42,\"yellow spaces\")","v":"yellow spaces"}]
[{"$nulls":12},"Capital Equipment >$2,500 on Payment Plan",{"$f":"IF(N48>3,Y42-AC42+AF42,\"on the\")","v":"on the"}]
[{"$nulls":12},"Category Total",{"$f":"IF(N48>3,SUM(N44:N46)+SUM(Q18:Q42),\"summary page\")","v":"summary page"}]
[{"$nulls":13},{"$f":"Summary!O12","v":{"v":1,"d":"1.00"}}]

{"sheet":"2nd page","index":14,"n_rows":45,"n_cols":25,"rows_kept":45,"merged":[[0,2,0,3],[3,5,3,7],[3,8,3,10],[4,5,4,7],[4,8,4,10],[5,5,5,7],[5,8,5,10],[6,5,6,7],[6,8,6,10],[7,5,7,7],[7,8,7,10],[8,5,8,7],[8,8,8,10],[10,7,10,10],[10,15,10,19],[10,20,11,20],[10,21,11,21],[10,22,11,22],[10,23,11,23],[10,24,11,24],[11,1,11,3],[11,4,11,6],[11,7,11,10],[11,16,11,19],[12,1,12,3],[12,4,12,6],[12,7,12,10],[13,1,13,3],[13,4,13,6],[13,7,13,10],[13,16,13,19],[14,1,14,3],[14,4,14,6],[14,7,14,10],[14,16,14,19],[15,1,15,3],[15,4,15,6],[15,7,15,10],[15,16,15,19],[16,1,16,3],[16,4,16,6],[16,7,16,10],[16,16,16,19],[17,1,17,3],[17,4,17,6],[17,7,17,10],[17,16,17,19],[18,1,18,3],[18,4,18,6],[18,7,18,10],[18,16,18,19],[19,1,19,3],[19,4,19,6],[19,7,19,10],[19,16,19,19],[20,1,20,3],[20,4,20,6],[20,7,20,10],[20,16,20,19],[21,1,21,3],[21,4,21,6],[21,7,21,10],[21,16,21,19],[22,1,22,3],[22,4,22,6],[22,7,22,10],[22,16,22,19],[23,1,23,3],[23,4,23,6],[23,7,23,10],[23,16,23,19],[24,1,24,3],[24,4,24,6],[24,7,24,10],[24,16,24,19],[25,1,25,3],[25,4,25,6],[25,7,25,10],[25,16,25,19],[26,1,26,3],[26,4,26,6],[26,7,26,10],[26,16,26,19],[27,1,27,3],[27,4,27,6],[27,7,27,10],[27,16,27,19],[28,1,28,3],[28,4,28,6],[28,7,28,10],[28,16,28,19],[29,1,29,3],[29,4,29,6],[29,7,29,10],[29,16,29,19],[30,1,30,3],[30,4,30,6],[30,7,30,10],[30,16,30,19],[31,1,31,3],[31,4,31,6],[31,7,31,10],[31,16,31,19],[32,1,32,3],[32,4,32,6],[32,7,32,10],[32,16,32,19],[33,1,33,3],[33,4,33,6],[33,7,33,10],[33,16,33,19],[34,1,34,3],[34,4,34,6],[34,7,34,10],[34,16,34,19],[35,1,35,3],[35,4,35,6],[35,7,35,10],[35,16,35,19],[36,1,36,3],[36,4,36,6],[36,7,36,10],[36,16,36,19],[37,1,37,3],[37,4,37,6],[37,7,37,10],[37,16,37,19],[38,1,38,3],[38,4,38,6],[38,7,38,10],[38,16,38,19],[39,1,39,3],[39,4,39,6],[39,7,39,10],[39,16,39,19],[40,1,40,3],[40,4,40,6],[40,7,40,10],[40,16,40,19],[42,0,45,7]]}
["Page 2 of",null,"none",{"$nulls":6},"Name",{"$f":"'Meals-Students'!F3","v":"No grocery receipts are required."}]
[null,null,"(enter expense category)",{"$nulls":6},"Dept/Project",{"$f":"'Meals-Students'!F8","v":0}]
["EXAMPLES",{"$nulls":15},"none","00000"]
[{"$nulls":5},"Abbreviations:",{"$nulls":10},"Transportation",50101]
["**Expenses must be submitted with",{"$nulls":4},"PD=Partnership Development",{"$nulls":10},"Donor Care",50103]
["   in 60 days of being incurred.",{"$nulls":4},"ICF=International Christian Fellowship",{"$nulls":10},"Office Expense",50105]
[{"$nulls":16},"Professional Growth",50109]
["*ORIGINAL Receipt required if $75.00 or greater",{"$nulls":3},"                      ",{"$nulls":11},"Out-of-town Travel",50107]
["   List complete information below for all expenses.",{"$nulls":15},"Ministry Operations",50111]
[{"$nulls":16},"Capital Equipment < $1,000(Eqmnt Exp)",50113]
["Date",{"$nulls":6},"Location",{"$nulls":7},"office use only",{"$nulls":4},"amt  +/-","disallow","exception",null,"for audit work"]
["(mm/dd/yy)","Name of Vendor",null,null,"Ministry purpose",null,null,"(Company)",{"$nulls":3},"Amount",{"$nulls":3},"initials","correction explanation"]
[{"$nulls":12},{"$f":"IF(L13>=75,\"*\",\" \")","v":" "},null,{"$f":"IF(L13>=75,L13,\" \")","v":" "}]
[{"$nulls":12},{"$f":"IF(A14>0,IF(submit_date>0,IF(submit_date-A14>60,\"disallow\",IF(L14>=75,IF(AND(N14=\"\",TODAY()-submit_date>30),\"disallow\",\"*\"),\" \")),IF(TODAY()-A14>60,\"disallow\",IF(L14>=75,IF(AND(N14=\"\",TODAY()-submit_date>30),\"disallow\",\"*\"),\" \"))),IF(L14>=75,IF(AND(N14=\"\",TODAY()-submit_date>30),\"disallow\",\"*\"),\"\"))","v":""},null,{"$f":"IF(AND(L14>=75,M14<>\"disallow\"),1,\" \")","v":" "},{"$nulls":6},{"$f":"IF(AND(M14=\"disallow\",W14=0),L14,0)","v":0},null,{"$f":"IF(W14>0,-U14,0)","v":0},{"$f":"IF(AND(A14<Fiscal_Start_Date,submit_date-A14<90,submit_date>=0),L14,0)","v":0}]
[{"$nulls":12},"",null,{"$f":"IF(AND(L15>=75,M15<>\"disallow\"),1,\" \")","v":" "},{"$nulls":6},{"$f":"IF(AND(M15=\"disallow\",W15=0),L15,0)","v":0},null,{"$f":"IF(W15>0,-U15,0)","v":0},0]
[{"$nulls":12},"",null," ",{"$nulls":6},0,null,0,0]
[{"$nulls":12},"",null," ",{"$nulls":6},0,null,0,0]
[{"$nulls":12},"",null," ",{"$nulls":6},0,null,0,0]
[{"$nulls":12},"",null," ",{"$nulls":6},0,null,0,0]
[{"$nulls":12},"",null," ",{"$nulls":6},0,null,0,0]
[{"$nulls":12},"",null," ",{"$nulls":6},0,null,0,0]
[{"$nulls":12},"",null," ",{"$nulls":6},0,null,0,0]
[{"$nulls":12},"",null," ",{"$nulls":6},0,null,0,0]
[{"$nulls":12},"",null," ",{"$nulls":6},0,null,0,0]
[{"$nulls":12},"",null," ",{"$nulls":6},0,null,0,0]
[{"$nulls":12},"",null," ",{"$nulls":6},0,null,0,0]
[{"$nulls":12},"",null," ",{"$nulls":6},0,null,0,0]
[{"$nulls":12},"",null," ",{"$nulls":6},0,null,0,0]
[{"$nulls":12},"",null," ",{"$nulls":6},0,null,0,0]
[{"$nulls":12},"",null," ",{"$nulls":6},0,null,0,0]
[{"$nulls":12},"",null," ",{"$nulls":6},0,null,0,0]
[{"$nulls":12},"",null," ",{"$nulls":6},0,null,0,0]
[{"$nulls":12},"",null," ",{"$nulls":6},0,null,0,0]
[{"$nulls":12},"",null," ",{"$nulls":6},0,null,0,0]
[{"$nulls":12},"",null," ",{"$nulls":6},0,null,0,0]
[{"$nulls":12},"",null," ",{"$nulls":6},0,null,0,0]
[{"$nulls":12},"",null," ",{"$nulls":6},0,null,0,0]
[{"$nulls":12},"",null," ",{"$nulls":6},0,null,0,0]
[{"$nulls":12},"",null," ",{"$nulls":6},0,null,0,0]
[{"$nulls":12},"",null," ",{"$nulls":6},0,null,0,0]
[{"$nulls":12},"",null," ",{"$nulls":6},0,null,0,0]
[{"$nulls":13},{"$f":"COUNTIF(N14:N41,\"x\")","v":0},{"$nulls":6},{"$f":"SUM(U14:U41)+X42","v":0},{"$f":"SUM(V14:V41)","v":0},{"$f":"COUNTA(W14:W41)","v":0},{"$f":"SUM(X14:X41)","v":0},{"$f":"SUM(Y14:Y41)","v":0}]
[{"$f":"IF(L43>0,\"DON’T FORGET TO ATTACH YOUR RECEIPT DOCUMENTATION TO THE EMAIL\",\"\")","v":""},{"$nulls":9},"Total of Receipts to be Mailed",{"$f":"IF(FundCode<>500,COUNT(L13:L37),SUM(O13:O41))","v":0}]
[]
[{"$nulls":10},"Category Total",{"$f":"SUM(L13:L41)+U42-V42","v":0}]